<?xml version="1.0" encoding="UTF-8" standalone="no"?>
<svg
   version="1.1"
   width="254.03378"
   height="335.66833"
   viewBox="0 0 127.01689 167.83417"
   id="svg494"
   xmlns:xlink="http://www.w3.org/1999/xlink"
   xmlns="http://www.w3.org/2000/svg"
   xmlns:svg="http://www.w3.org/2000/svg"
   xmlns:rdf="http://www.w3.org/1999/02/22-rdf-syntax-ns#"
   xmlns:cc="http://creativecommons.org/ns#"
   xmlns:dc="http://purl.org/dc/elements/1.1/">
  <metadata
     id="metadata373">
    <rdf:RDF>
      <cc:Work
         rdf:about="">
        <dc:format>image/svg+xml</dc:format>
        <dc:type
           rdf:resource="http://purl.org/dc/dcmitype/StillImage" />
        <dc:subject>Dragora GNU/Linux-libre</dc:subject>
        <cc:license
           rdf:resource="http://creativecommons.org/licenses/by-sa/4.0/" />
      </cc:Work>
      <cc:License
         rdf:about="http://creativecommons.org/licenses/by-sa/4.0/">
        <cc:permits
           rdf:resource="http://creativecommons.org/ns#Reproduction" />
        <cc:permits
           rdf:resource="http://creativecommons.org/ns#Distribution" />
        <cc:requires
           rdf:resource="http://creativecommons.org/ns#Notice" />
        <cc:requires
           rdf:resource="http://creativecommons.org/ns#Attribution" />
        <cc:permits
           rdf:resource="http://creativecommons.org/ns#DerivativeWorks" />
        <cc:requires
           rdf:resource="http://creativecommons.org/ns#ShareAlike" />
      </cc:License>
    </rdf:RDF>
  </metadata>
  <style
     type="text/css"
     id="style375">
        .veins {
            stroke-width: 0.6;
            stroke-linecap: round;
            fill: none;
        }
        </style>
  <defs
     id="defs412">
    <linearGradient
       id="linearGradient1346">
      <stop
         style="stop-color:#ba8a4d;stop-opacity:1;"
         offset="0"
         id="stop1342" />
      <stop
         style="stop-color:#342c45;stop-opacity:1;"
         offset="0.5716548"
         id="stop1344" />
    </linearGradient>
    <radialGradient
       id="b-3"
       cx="140.7"
       cy="102"
       r="43.299999"
       gradientTransform="matrix(1.2,0.56,-1,2,73.110157,-188.30973)"
       gradientUnits="userSpaceOnUse">
      <stop
         stop-color="#1c8c44"
         offset="0"
         id="stop401-6" />
      <stop
         stop-color="#a4d275"
         offset="1"
         id="stop403-7" />
    </radialGradient>
    <linearGradient
       xlink:href="#linearGradient1346"
       id="linearGradient1348"
       x1="125.54385"
       y1="82.853241"
       x2="125.54385"
       y2="233.15532"
       gradientUnits="userSpaceOnUse" />
  </defs>
  <g
     id="Leaves"
     transform="matrix(0.62925907,0,0,0.62925907,-16.235173,-12.862433)">
    <g
       id="g429-5"
       transform="matrix(-1,0,0,1,264.95062,-3.639762)">
      <path
         d="m 183.71016,103.09027 c 12.11,-3.243001 6.201,-18.850001 55.44,-14.520001 -9.955,-5.956 -19.29,-18.27 -23.74,-18.72 -15.3,-1.525 -16.35,-4.642 -22.67,-4.642 -4.605,0 -13.51,0.7 -20.48,4.251 0.23,-2.472 12.63,-3.955 17.49,-8.623 3.327,-3.199 8.493,-11.47 17.67,-16.17 7.411,-3.8 23.92,-5.36 29.47,-6.827 -29.67,-20.17 -37.61,-12.21 -37.61,-12.21 -2.12,1.485 -8.445,-6.529 -27.06,5.385 1.635,18.69 -0.24,23.04 -6.487,31.97 -7.219,10.31 -16.57,11.22 -19.29,13.94 -1.539,1.539 -12.87,9.23 -9.687,29.970001 15.08,0.7 36.41,-0.95 46.97,-3.782 z"
         fill="url(#b)"
         id="path425-3"
         style="fill:url(#b-3)" />
    </g>
    <use
       x="0"
       y="0"
       xlink:href="#g429-5"
       id="use333"
       transform="matrix(-1,0,0,1,253.0845,1.5891706)" />
  </g>
  <g
     id="Roots"
     transform="translate(-65.380504,-63.923183)"
     style="display:inline">
    <g
       class="veins"
       stroke="#2b1a0e"
       id="g470" />
    <path
       d="m 87.025,227.213 c 17.63379,-0.89652 39.70084,-10.64749 43.44138,-24.40138 11.59933,17.60198 26.98759,21.24473 45.22962,28.71438 -13.7616,-12.33908 -34.33646,-19.88213 -39.282,-34.57 9.19215,-6.97059 15.71233,-24.92037 11.644,-37.007 -6.32,-13.55 2.173,-23.68 2.061,-32.04 27.93593,-0.22728 9.7081,-41.979929 26.99,-32.158 -4.3398,5.39657 1.1747,4.89006 -6.285,8.003 -2.01167,1.44632 -0.50178,9.9629 -0.154,12.962 -6.47796,4.95133 -4.7166,4.43275 -0.826,8.97 0,0 2.548,-0.54 2.741,-1.315 l -2.505,-0.295 c 0.066,-0.917 -0.105,-1.786 0.443,-2.799 l 2.357,-3.1 v -0.884 l 2.357,-2.653 -1.62,-1.326 1.62,-1.915 -0.589,-1.474 c 0,0 1.72,-2.142 2.946,-1.621 2.325,0.988 1.569,2.356 -0.194,3.23 0.9,1.282 0.161,2.08 -0.69,2.845 l 2.21,0.705 c 0.042,2.199 -0.23,2.586 -2.14,4 l 3.17,1.309 c 0.639,1.368 -1.62,1.916 -1.62,1.916 0,0 0.566,1.422 1.767,2.209 0,0 0.033,1.047 -1.178,1.327 0,0 -2.959,-0.5 -3.308,-0.358 l 1.687,1.831 c 1.449,0.26 2.848,0.71 4.4,0.038 3.38461,-1.23841 5.16294,-4.95726 3.531,-6.911 -0.87,-1.251 -0.933,-3.309 -1.154,-5.209 2.1634,-0.86857 0.76036,-2.65866 1.404,-4.094 1.155,-2.425 2.657,-7.714 4.343,-6.96 -1.89,-7.19 -0.36,-11.53 -0.295,-17.1 -2.062,-2.363 -2.48,-7.697 -5.01,-4.273 1.903,0.2588 1.179,6.19 1.179,6.19 -2.495,-1.706 -7.774,-5.476 -13.11,-5.01 -21.5639,3.685541 -14.31207,31.29525 -25.08061,32.251 -8.99723,-8.71267 -32.55933,-5.19964 -37.34839,-1.197 -11.202919,-7.2751 -8.37581,-29.236291 -25.01,-31.061 -5.34,-0.4672 -10.62,3.3 -13.11,5.01 0,0 -0.7236,-5.93 1.179,-6.19 -2.53,-3.424 -2.95,1.91 -5.01,4.273 0.065,5.561 1.595,9.902 -0.2946,17.1 1.686,-0.758 3.19,4.53 4.343,6.96 0.542112,2.35965 -0.629944,2.5603 1.404,4.093 -0.2207,1.9 -0.2838,3.96 -1.154,5.2 -1.987055,3.14811 1.040861,5.80929 3.5327,6.911 1.552,0.67 2.95,0.22 4.4,-0.038 l 1.687,-1.831 c -0.3492,-0.141 -3.307,0.358 -3.307,0.358 -1.212,-0.28 -1.18,-1.326 -1.179,-1.326 1.2,-0.79 1.768,-2.21 1.768,-2.21 0,0 -2.26,-0.548 -1.62,-1.916 l 3.17,-1.309 c -1.91,-1.41 -2.181,-1.796 -2.139,-3.996 l 2.21,-0.704 c -0.8505,-0.766 -1.6,-1.562 -0.6897,-2.846 -1.763,-0.871 -2.519,-2.24 -0.1944,-3.227 1.227,-0.522 2.947,1.62 2.947,1.62 l -0.5893,1.474 1.62,1.915 -1.62,1.327 2.357,2.652 v 0.884 l 2.357,3.094 c 0.5475,1.014 0.3767,1.883 0.442,2.799 l -2.505,0.295 c 0.1929,0.775 2.742,1.316 2.742,1.316 5.47204,-3.99886 4.186657,-4.992 -0.827,-8.977 -0.275169,-4.18218 0.754716,-11.29919 -2.073141,-12.66281 -1.998,-0.81 -3.039524,-1.39705 -3.566524,-2.84305 3.487244,-3.73081 -3.621288,-3.341836 -0.757498,-5.70158 6.73508,-4.522022 8.450275,25.05824 26.954163,32.39744 -0.444,7.813 6.10413,16.25 2.68813,35.61 -1.929,10.95 5.58787,26.23 12.96987,33.85 -2.4093,17.30106 -29.11883,26.04185 -36.2567,29.87 z"
       fill="#70614e"
       id="path472"
       style="fill:url(#linearGradient1348);fill-opacity:1;fill-rule:nonzero;stroke:#fdfefd;stroke-width:0.5;stroke-dasharray:none;stroke-opacity:1" />
    <circle
       cx="72.580002"
       cy="102.8"
       fill="#fdffd5"
       id="ellipse476"
       style="fill:#ffffff"
       r="1.771111" />
    <circle
       cx="184.91028"
       cy="102.82898"
       fill="#fdffd5"
       id="ellipse476-5"
       style="fill:#ffffff"
       r="1.771111" />
  </g>
</svg>
