/* XPM */
static char * 3210_xpm[] = {
"129 333 174 2",
"  	c None",
". 	c #DADADA",
"+ 	c #D6D6DE",
"@ 	c #D6CED6",
"# 	c #CECED6",
"$ 	c #C6C6CE",
"% 	c #B5BDCE",
"& 	c #B5ADBD",
"* 	c #B5ADAD",
"= 	c #ADADBD",
"- 	c #DAD6D6",
"; 	c #BDC6CE",
"> 	c #9C949C",
", 	c #848C9C",
"' 	c #6B6B7B",
") 	c #5A6363",
"! 	c #6B6B73",
"~ 	c #5A5A63",
"{ 	c #4A525A",
"] 	c #4A4A52",
"^ 	c #424A4A",
"/ 	c #394242",
"( 	c #394252",
"_ 	c #313941",
": 	c #63636B",
"< 	c #757B7B",
"[ 	c #7B778C",
"} 	c #A59CAD",
"| 	c #BDB5BD",
"1 	c #CED6DE",
"2 	c #ADB5CE",
"3 	c #949CAD",
"4 	c #4A3F41",
"5 	c #4A5263",
"6 	c #C6CED6",
"7 	c #C6C6D6",
"8 	c #9CA5BD",
"9 	c #898EAA",
"0 	c #5A6B73",
"a 	c #332B2E",
"b 	c #4A4A5A",
"c 	c #524A5E",
"d 	c #525263",
"e 	c #52526B",
"f 	c #525A5A",
"g 	c #525A63",
"h 	c #5A5A6F",
"i 	c #525A6B",
"j 	c #5A6373",
"k 	c #7B849C",
"l 	c #BDC6D6",
"m 	c #949CB5",
"n 	c #5A637B",
"o 	c #63635A",
"p 	c #5A636B",
"q 	c #526479",
"r 	c #5E677B",
"s 	c #636363",
"t 	c #636373",
"u 	c #636B6B",
"v 	c #7B7B94",
"w 	c #D6CECE",
"x 	c #52524A",
"y 	c #808080",
"z 	c #C6BDCE",
"A 	c #445D78",
"B 	c #262E36",
"C 	c #ADA5A5",
"D 	c #5A526B",
"E 	c #4A524A",
"F 	c #7384A5",
"G 	c #83A2C9",
"H 	c #9CADC6",
"I 	c #9CB5D6",
"J 	c #ADC6DE",
"K 	c #627794",
"L 	c #6B6B84",
"M 	c #424A63",
"N 	c #81737E",
"O 	c #ADBDD6",
"P 	c #B5B5D6",
"Q 	c #BDBDD6",
"R 	c #BDC6DE",
"S 	c #CEC6DE",
"T 	c #C6C6DE",
"U 	c #C6CEDE",
"V 	c #CECEE7",
"W 	c #DAE2E2",
"X 	c #CECEF7",
"Y 	c #BDCED6",
"Z 	c #6B6767",
"` 	c #89838C",
" .	c #DEDEEF",
"..	c #E7E7EF",
"+.	c #CECEDE",
"@.	c #948CA0",
"#.	c #636B77",
"$.	c #9CA5AD",
"%.	c #626F7F",
"&.	c #909494",
"*.	c #B5C6D6",
"=.	c #ADBDCE",
"-.	c #D6CEE7",
";.	c #D6DEEF",
">.	c #DEDEF7",
",.	c #737B8C",
"'.	c #D6D6EF",
").	c #E7E7F7",
"!.	c #EFEFF7",
"~.	c #E7EFF7",
"{.	c #9C848C",
"].	c #E7EFFF",
"^.	c #EFEFFF",
"/.	c #EFF7FF",
"(.	c #C1D6EF",
"_.	c #62525E",
":.	c #E7E7FF",
"<.	c #CED6EF",
"[.	c #39526B",
"}.	c #A5ADC6",
"|.	c #EFE7FF",
"1.	c #F7F7FF",
"2.	c #F7FFFF",
"3.	c #707081",
"4.	c #737384",
"5.	c #FFF7FF",
"6.	c #D2D6CE",
"7.	c #E7DEEF",
"8.	c #F7F7F7",
"9.	c #BDCEDE",
"0.	c #BDC6E7",
"a.	c #EFE7F7",
"b.	c #635A6B",
"c.	c #6B6377",
"d.	c #4A4A73",
"e.	c #EFF7EF",
"f.	c #DAD6E7",
"g.	c #FFFBF0",
"h.	c #F7EFF7",
"i.	c #FFF7F7",
"j.	c #E7DEE7",
"k.	c #CEC6D6",
"l.	c #F7F7EF",
"m.	c #B5C6DE",
"n.	c #1B1B23",
"o.	c #121414",
"p.	c #F7EFEF",
"q.	c #000008",
"r.	c #000808",
"s.	c #101010",
"t.	c #627373",
"u.	c #181515",
"v.	c #212129",
"w.	c #B5CAE7",
"x.	c #E7E7DE",
"y.	c #636B63",
"z.	c #000000",
"A.	c #1E1E18",
"B.	c #B5CED6",
"C.	c #0D0D0D",
"D.	c #AD8C9C",
"E.	c #526B52",
"F.	c #5A7B5A",
"G.	c #639463",
"H.	c #6DC069",
"I.	c #63CE63",
"J.	c #70D86D",
"K.	c #5ACE63",
"L.	c #786273",
"M.	c #DADEDA",
"N.	c #080404",
"O.	c #0C080C",
"P.	c #000800",
"Q.	c #080808",
"                                                                                                                                                                                                                                                                  ",
"                                                                                                                                                                                                                                                                  ",
"                                                                                                                                                                                                                                                                  ",
"                                                                                                                                                                                                                                                                  ",
"                                                                                                                                                                                                                                                                  ",
"                                                                                                                                                                                                                                                                  ",
"                                                                                                                                                                                                                                                                  ",
"                                                                                                                                                                                                                                                                  ",
"                                                                                                                                                                                                                                                                  ",
"                                                                                                                                                                                                                                                                  ",
"                                                                                                                                                                                                                                                                  ",
"                                                                                                                                                                                                                                                                  ",
"                                                                                                                                                                                                                                                                  ",
"                                                                                                                                                                                                                                                                  ",
"                                                                                                                                                                                                                                                                  ",
"                                                                                                                                                                                                                                                                  ",
"                                                                                                                                                                                                                                                                  ",
"                                                                                                                                                                                                                                                                  ",
"                                                                                                                                                                                                                                                                  ",
"                                                                                                                                                                                                                                                                  ",
"                                                                                                                                                                                                                                                                  ",
"                                                                                                                                                                                                                                                                  ",
"                                                                                                                                                                                                                                                                  ",
"                                                                                                                                                                                                                                                                  ",
"                                                                                                                                                                                                                                                                  ",
"                                                                                                                                                                                                                                                                  ",
"                                                                                                                                                                                                                                                                  ",
"                                                                                                                                                                                                                                                                  ",
"                                                                                                                                                                                                                                                                  ",
"                                                                                                                                                                                                                                                                  ",
"                                                                                                                                                                                                                                                                  ",
"                                                                                                                                                                                                                                                                  ",
"                                                                                                                                                                                                                                                                  ",
"                                                                                                                                                                                                                                                                  ",
"                                                                                                                                                                                                                                                                  ",
"                                                                                                                                                                                                                                                                  ",
"                                                                                                                                                                                                                                                                  ",
"                                                                                                                                                                                                                                                                  ",
"                                                                                                                                                                                                                                                                  ",
"                                                                                                                                                                                                                                                                  ",
"                                                                                                                                                                                                                                                                  ",
"                                                                                                                                                                                                                                                                  ",
"                                                                                                                                                                                                                                                                  ",
"                                                                                                                                                                                                                                                                  ",
"                                                                                                                                                                                                                                                                  ",
"                                                                                                                                                                                                                                                                  ",
"                                                                                                                                                                                                                                                                  ",
"                                                                                                                                                                                                                                                                  ",
"                                                                                                                                                                                                                                                                  ",
"                                                                                                                                                                                                                                                                  ",
"                                                                                                                                                                                                                                                                  ",
"                                                                                                                                                                                                                                                                  ",
"                                                                                                                                                                                                                                                                  ",
"                                                                                                                                                                                                                                                                  ",
"                                                                                                                                                                                                                                                                  ",
"                                                                                                                                                                                                                                                                  ",
"                                                                                                                                                                                                                                                                  ",
"                                                                                                                                                                                                                                                                  ",
"                                                                                                                                                                                                                                                                  ",
"                                                                                                                                                                                                                                                                  ",
"                                                                                                                                                                                                                                                                  ",
"                                                                                                                                                                                                                                                                  ",
"                                                                                                                                                                                                                                                                  ",
"                                                                                                                                                                                                                                                                  ",
"                                                                                                                                                                                                                                                                  ",
"                                                                                                                                                                                                                                                                  ",
"                                                                                                                                                                                                                                                                  ",
"                                                                                                                                                                                                                                                                  ",
"                                                                                                                                                                                                                                                                  ",
"                                                                                                                                                                                                                                                                  ",
"                                                                                                                                                                                                                                                                  ",
"                                                                                                                                                                                                                                                                  ",
"                                                                                                                                                                                                                                                                  ",
"                                                                                                                                                                                                                                                                  ",
"                                                                                                                                                                                                                                                                  ",
"                                                                                                                                                                                                                                                                  ",
"                                                                                                                                                                                                                                                                  ",
"                                                                                                    . . + @ @ + @ # $ $ $ # $ % % & & * & = * * = = & $ $ # $ $ @ + . @ @ + - . . .                                                                               ",
"                                                                                    . . . + + @ . + @ ; * = > , , ' ) ! ~ { ] ] ^ ^ ] ^ / ( / / / _ ( ] ] ] ~ : < [ , > } | # # + . @ + + - . . .                                                                 ",
"                                                                          . . + @ + 1 % | 2 3 , ! { ] / / _ _ _ _ _ / _ / _ 4 ( ^ ^ ^ ( ^ ^ ^ ( ] ^ ^ ( ^ ^ / ( _ 4 / ( _ _ _ / ^ 5 , 3 = ; 6 + + @ + . . . .                                                     ",
"                                                                . . . + 6 7 ; 8 9 0 5 _ _ a / _ / / _ ^ ] ^ ] ] { { b c b b ] { { d e f g h g { { 5 g 5 i d { 5 { { i ~ ] b f d g ( _ _ _ _ _ { j k 3 % ; 7 @ + . . .                                             ",
"                                                          . . + # l m k n ] ( _ _ _ _ / ^ ] d { { f b { f f d o i d 5 f ~ g p 0 q 5 f h r h g i q i i 5 h g i d g 5 5 : s ) t t u p 5 f { ] ] ^ _ _ _ _ _ h v 3 % w + - . . .                                     ",
"                                                    . . @ $ = [ t ] _ _ / ^ { { f { 5 q ) { i 5 o t g 5 x 5 g ~ s h g 5 f ~ s ~ d d x ] ] ] { ] ] b { { ] { f ~ h g i j j : : d d h 5 g 5 d ~ ) e d { { ( _ _ _ 4 ~ y } z - + - . .                               ",
"                                                . @ # } ' ^ _ / ] { ] ] b g f b ~ g g { 5 d d f ~ A ~ o { ( ^ 4 a a _ B B _ a _ _ _ _ _ ( ( ( ( ( _ _ _ _ B _ a a _ ] ] ^ { 5 f g i i : ~ i h s f 5 p ~ 5 5 { { ( ( / / c ' C w - + .                             ",
"                                          - + @ * < 4 4 b ^ ^ 5 i f g D q x g e q x 5 5 { E b 4 _ _ _ _ _ ( e q q F 9 F G m G H G G H I J J I J I I I G G m m 9 F K L A e M ( _ x _ ( _ ^ { ] 5 h t : h j h ~ h d d d b { ^ _ 4 N | w + .                         ",
"                                        + 6 3 { _ ( b f d 5 i q ~ p ~ ~ j p g { ( _ ] _ _ ^ ] d L v 9 9 8 2 O ; % l l % P l z 7 Q % % l R $ 7 7 S T U V S U U U W V X V V U P = m , ' b ] 4 ^ / ( ( / b e r s : r u p L : f ] b ( / < & # + .                     ",
"                                    + Y 9 ] ^ { d f f d h : ) i j ! g M ] ] ] ( x Z < ` 3 = = 2 % l % % % % % % % P Q % % % % l l Q ; Q % % % l l ; R T R ; 7 U 7 6 7 7 # + W  ...W  .+.6 7 z @.y ) E / _ ( ( b p ' r ' ! #.' : g f b ] ) $.+..                   ",
"                                  + H i ^ ] p ) h f : g h %.#.d b b ^ g #.` &.$.= | ; Q *.2 % % % 2 2 | 2 2 % 2 =.2 =.% % % % % l % Q =.% ; l Q l ; R T 7 7 7 U 6 U U +.6 + V +.1 -.V + ;.;.W ;.>.+ 1 $ = &.' M ( 4 ] D j %.t h h s #.#.{ ^ t & - .               ",
"                              . + K ] x d 5 g h e j : d ( ( M { 0 ,.&.=.; | % % & & % P & % Q % & % % 2 & = 2 = & % 2 % % 2 2 % % % % % l % ; 7 R $ ; 7 T 7 U +.+.# +.1 7 1 U U +.+ V +.@ + + + ;.'. .).!.~. .1 I 9 q ( _ 4 c i : %.%.' ~ i ~ ] {.@ .             ",
"                            . + ,.] ~ g f q h ~ f ( _ ( A K 9 H % % =.% ; 2 = 2 = 2 2 2 % % % 2 =.% % % 2 & =.% % ; Q % % % % ; Q % % l % % 7 7 R l 7 T 7 6 U U + +.+.+.1 U V + W '.V +.+ '.+ '.'.+ + W >.].).].^./.>.(.I K M _ 4 _.p n Z ! j q { {.@ -           ",
"                          . + ` ^ ~ ~ ~ j p g _ 4 A K m *.; ; =.% & = 2 2 % 2 2 | | 2 % & & 2 2 & % 2 = & % % % % Q % | % % % ; Q Q % l P % ; l R 7 U U R 7 7 U +.1 7 U +.+.U + + V V + + + '.'.+ ;. . .>.:.].:.].:.^.^././.<.=.v { _ 4 : ,.%.' L 5 > + .         ",
"                          + 8 E g { j ) L [.b ,.8 Q l % % % % % & =.| 2 =.& | % % 2 2 Q % =.% % % 2 }.% 2 2 % % % ; Q ; % l % % P =.l l P % ; l l l l T +.7 U + +.+.U +.1 V '.+ +.+ U # '.'.W  .'.'.>.;.).).).).).].^.].|.].1.2.2. .= ! x ^ 3.4.,.' 5 } + .       ",
"                        + *.b f u d p j ( 4.= % l % % 2 Q O 2 % =.& % 2 }.| % % 2 = 2 2 & % Q =.% 2 2 % & 2 =.& % P % | % Q ; % *.Q ; % P ; ; l Q U 7 +.+.T U U U +.+ '.+ U U 1 1 V V 1 +  . .'.;.;.;.;.>. .).).:.^.^.:././.^.^.5.2.2.1.6.j ] ! < , r ] z - .     ",
"                      . 1 A ] g f e L h ,.% 2 % % % ; % % % & % % % & 2 =.% % % & & % % 2 & % 2 2 % % % % 2 = = % l ; =.% % % l ; % Q l T # % Q l 7 7 T U + U U 1 1 + W +.+ V +.+ '.V 1 ;.;.;. .>.>.+  .:.>.7.;.:./.:.^./.1.1.2.1.1.1.2.2.8.k 4 ! v ,.5 < - 6.    ",
"                      + m _ f f { Z k &.; =.% % % % ; % % % ; % & =.& % % & =.=.& % % % % = 2 & & 2 % % & % % & % ; % ; 7 R l ; ; *.; 7 T 6 7 R +.+.U V U +.+.'.U U U + + V '.W + U V '.;.'. . . .'.;. .|.:.>.>.:.).).^.1.1.1.1.1.1.2.2.1.5.2.,.4 ,., ,.g & . .   ",
"                    . 1 { ] d ) f [ [ = % 2 ; ; P Q P l % % ; ; % % = 2 % % % % = % ; % % % 2 % =.% Q l % % T % l Q U 7 U 7 Q ; R 7 7 T R U +.-.U U U V + U '.V U U U + V '.V 1 '.;.;.;.;.;. .;.>.>.).:.].^.:.:.>.:.:.^.^././.1.1./.5.1.1.1.2.~.d ~ k &.u ' - .   ",
"                    - G 4 { g { : n [ ; % Q 7 l % % % *.% % % P =.| % P % % ; % % % % Q ; % % Q % % Q R *.Q Q l 7 R l 7 U U Q $ U U l T U 1 V V U U U V + + '.<.U + V V ;.'.'.;.;.;.;.;.;.;.;.>.:.).>.).^.:.:.:.].].^.^.^.^.1.1.1.2.2.2.2.2.2.5.2 4 ` 3 k i z 6.. ",
"                    + q ^ g g f ,.q 3 % % R ; % 2 % % = % % % =.}.2 % ; 7 ; % Q ; % l *.% 7 l R 7 7 R ; ; U R +.T T U 7 +.U 7 6 R 7 7 U U + +.U U +.V '.'.+ V '.V '.'.'.+  .>. .'.;.;.;.;.;. . .;.:.).).~.].~.].1.^.|./.1./././.1.2.2.5.2.1.1.2./.h [ > 3 %.} - + ",
"                  . 9.] d g ) : h d & % % % ; % % % % % % % % % % % % % % % % Q ; 7 Q Q % ; R l 7 7 Q ; 6 U 7 7 $ +.+.7 7 0.7 +.U U U +.+.1 +.+ ;.+ V V V '.+ V U ;.;.+ W ;.'. .;.;.'. .;.;.>. .>.:.a.].).^.^.]./.^./.^.^./.1.1.1.2.2.2.2.1.1.2.5.9 d 3 8 3.Z - - ",
"                  - H ^ f h 5 : A b.R % l % % l l Q % ; % % % % Q 7 U Q Q 7 l Q Q l l Q ; 7 0.l ; l R 6 7 l +.7 7 7 6 U V U +.T U U V U T U U U V + V V '.'.'.;.'.;.;.'. .;. . .>.;.;.).;.].^.>.^.].].^.:.).^.^.:.].^.^.^.1./.1.1./.1.1.1.1.2.1.2.}.b 8 8 [ ) $ . ",
"                  + k ^ f i d n h N U % l R Q % Q ; % Q Q *.; ; l T l R T 7 7 T R 7 l R ; Q R T T U T Q 7 T U 7 7 U U U R R U +.U +.U U U V 1 U V '.'.<.V V <.;.;.;.7.;.+ '.;.>.7.;.:.:.:.].:.:.].^.^.:.:.]./.].].^.^.^.1./.^./.1.2.1.1.5.2.2.2.5.9._ [ $.9 p & . ",
"                . + q ^ { g j c.e , T l l ; ; ; Q % ; ; R % % l ; Q Q T U l T U 7 7 6 R ; % l 7 6 l U 7 7 R 7 l 6 U l +.T U U T U +.+ U U T + '.V + '.'.+ '.'.'. . . .;. .).:.;.;.). .;.).:.].^.:.:.^.].:.^.1.^.^.^.]./.1././.1.2.1.1.2.2.2.5.2.2.~.[.' = 8 q } - ",
"                + l M { { f { r d.8 T ; Q % % Q ; % l l 7 7 7 7 Q ; Q Q +.7 l U 6 7 U U l % 7 6 ; 6 U 7 ; U T 7 l T l 6 U U U T T +.U U U +.+ V +.+ V V '.'.'.;. .;.'.>.7.>.;. .>.;.>.>.).:.].].^.].].:.].].^.]./.^.^.1./.1././.1.2.2.2.2.2.2.2.2.5.r ~ 9 m u ` - ",
"                . =.] { { h : ,.M | T l % % l R 7 7 l R l R 7 Q R l % R R ; Q T R l T Q ; 7 l l Q 7 R l R T R 7 7 + +.6 U U +.6 U V +.U U U +.U V + V V '.'.;.;.'.'.;.>.>.;.>.>.>.;.>.).:.].].;.>.^.].].^.^./.^./.^./.1./.1./.1.1.2.1.^.1.5.1.2.2.2.F c 3 G 3.Z @ ",
"                - H ^ c ) d h n D +.7 7 R R U U R T % Q R 7 l T 7 l 7 +.R l R R l 7 U U Q R Q Q 7 7 R l 7 Q R l Q $ U U U U 7 +.V +.U V '.'.+ V ;.;.'.+  .;.;.;.;.;.>.'.;.;.>.>.).>.:.:.].:.].>.:.].].:./.^.1./.^.^././././.1.1././.^.].^.2.2.2.1.2.$.c @.@.3.: @ ",
"                . m _ x s h ~ M c.U % % R 7 U V U R 7 7 U # 6 T l % l 7 Q 7 T U l 7 7 R ; ; R l ; +.R 7 7 9.U U T R l 7 T U 7 +.V U +.V U + + U + + ;.'.'.;.;.;.+  .>.;.).;.;. .7.:.>.;.:.].:.].].^.^.].]././.^././.^././.1./././././.].).1.2.2.2.5.2 / ,.9 k x w ",
"                . &._ c Z 0 t d N U l ; l T >.;.R l R 7 R l U l % 7 7 T l 7 R R 7 l l % % T 7 l 7 U R R 7 U U 6 T U 7 7 7 U 6 +.V + + V U +.+ U U +.V ;.+ '.;.;.+ '.>.:.>.;.7.>.>.>. . .:.].^.]./.^.].^.].:.^.1././.1.1.1.1.1.^./././.>.+ !.2.5.2.5.9.] 4.m k f | ",
"                + K ^ f d 5 ' ~ @.U ; ; l +.1.>.R 7 $ R T l ; % l $ % Q l ; l Q % % 7 7 ; 7 R Q ; U R l 7 U U 6 7 T l 7 7 +.+.+.U + + T 7 U V '.V + V '. .+ ;.:.>.;.>.). . .>. .;.:.>.).^.|.^.^.].].:./.^././././.1.1././././.1.2.2.1.>.=. .2.2.2.5.W { ' 3 9 g } ",
"              . 1 %.] j g { [ d } R T 7 R + 5.].U R 7 T R % ; Q Q % ; Q l 7 T l ; 7 7 l 7 7 +.7 ; +.T l 7 U R +.U U U 7 T U +.U U + + V U V +.V '.+ 1 '.;.;.>.:.;.>.;.:.:.>.;.'.).:.:.:.:.^.^.].].].^.^./.1.2.1.1./.1./.2.2.2.2.5.1.2.>.= +.5.2.2.5.e.< ` 8 k i > ",
"              . 1 i ] x f g ' c % R l 7 Q  .5.>.9.R ; l l 7 7 l Q Q % Q T 7 ; % Q +.7 T ; 7 T +.6 +.T T 7 7 7 7 7 T U 7 U U l U U 1 + '.U V + V U + + '. .f. .;.7. .;.'.).>.;. .>.;.;.>.].].].].^.^.].^.^./.1././.^././.1.1.2.1.1.1.1.>.8 $ 2.2.2.5.2.9 ~ 3 3 0 ` ",
"              + 6 ] { p ) ~ L b.T Q Q ; l !.g.>.l 7 ; $ Q l 7 Q Q 7 % Q l 7 7 7 ; 7 U $ % ; R 7 ; 7 l U l 2 % ; Q U +.6 7 7 +.1 T +.+ V U '.+ V U + '.;. .W '.'.f. .;. .;.'.;.>.].:.).).].].].>.:.^.]./.1.1.1./././.2.2.2.2.2.2.2.2.2.>.$.| 1.2.2.5.2.9 ^ @.m ' 4.",
"              - Y M c ) p %.3.c.T R R ; T h.2.;.T R l T R R l R Q l l R U l 7 R ; l T l 7 ; R 7 ; l U 7 7 V 8 > } 2 l ; Q 7 6 U U 7 6 V V + + '.'.V '.'.;.'.V U W <.0.=.$.= f.:.:.>.].].:.:.^.].^.]./.1.2.1./.2.1.2.2.5.2./.1.1.2.2.2.].$.* 5.2.2.5.5.8 c 8 9 q #.",
"              - *./ b d ) ! g N U 0.U R +.i.5.>.U T R R l l 7 ; Q l ; Q T l 7 l ; R 7 l 7 T T 6 T R T l j.g.<.9 [ ` ` 3 2 *.% R R U 7 U + +.1 V '.W + V V 0.O l l H K ] _ < k.).].:.].].^.^.1.^./.^.2.1.1.1./.1.2.2.2.2.2.2.2.2.2.2.2.].8 C /.5.5.2.5.l 5 , 3 3.g ",
"              . H ( g g { ' e ` +.U U 7 -.g.2.;.Q 7 T ; Q ; ; Q T 7 % Q l ; T R % ; T R 7 T +.T U Q Q Q l.].q ( ( L > &.> 3 &.m 8 = 2 U V + + '.U U T m.H 3 | .. .q n.n.o.a & 7.^.:.:.>.].^././.^.^.1.1./.1.1.2.2.1.5.5.2.1.2.2.2.5.5./.= C ).5.2.2.5.. : 9 }.[ g ",
"              + 9 4 ~ ) g %.b @.+.U 6 ; '.5.2.V l 7 l Q l l l R l ; l l 7 $ ; ; ; % 7 +.$ 7 l l Q U 7 % p.~._ q.o._ ! ` $ =.{ b ' &.> 9 m 8 }.2 = 6.R F ] N j.'.'.%.r.s.r.a * /.^.:.^.].^.^.^.^./.^./.1./.1.1.1.2.1.2.2.2.2.2.2.5.2.2./.; = - 5.5.5.5.~.c.[ = k { ",
"              + k 4 d g : t 4 & U R 7 U 7.5.2.V 7 R 7 T T 7 l Q l 7 Q T T 7 T 7 $ 7 7 7 % ; R ; *.Q T l 7 U k / { 0 t.y @ G o.r.u.N % % = = ; 1 W 1.K o.q.x ` ' } =.t._ v.{ @ /.:.^.^.].^.].^.^.^.^././.2.2.1.1.1.2.2.2.2.2.2.2.5.5.2./.Y = @ 5.2.2.g./.K [ & 9 i ",
"            + @ k 4 { d s h c % 1 U l Q ..5.2.'.T l 7 T R Q 7 O ; ; Q Q Q 7 R T 7 l Q Q Q 7 l l l =.l 7 ; *.H H O 9.R Q V m n.o.B x < N y ` > C * | K _ o._ ,.I <.<.(.I H 0./.|.:.].^.^.^.].^./././.1.2.2.2.1.2.1.2.2.2.5.2.5.5.2.5.2.2.U = @ 5.2.2.5.2.k < 8 k g ",
"            . U j ] d { ~ e b.z T U U l a.5.2.U T 7 l Q l l % Q Q 7 ; R R % Q Q ; 7 l l ; l l T ; Q l l l R 1 1 U U 6 7 V H g g #.v 9 }.O w.w.O }.} C 9 r s & :.;.;.;.;.].>.|.:.^.:.^.^.^.].^.1.1.1.2.2.1.2.2.2.2.2.5.2.2.5.5.2.2.2.5.2.U & 6.5.5.2.5.2.3 d 3 m q ",
"            - 1 { ] h d p ] c.-.l U U 7 !.g.1.9.U 7 ; R U 7 l l R ; 7 Q % % Q % % *.l 7 l % Q % % 7 T Y l T T 6 U U 7 U T l = % Q '.;.;.'.'. .;.'.+ U T ; z ;.'.'.:.).'. .>.;.>.:.:.].].].^.^././.^.2.1.1.1.2.2.2.5.2.2.2.2.5.2.5.5.2.2.1 & % g.2.5.5.5.& ~ } H q ",
"            . Y ] { ~ f t M N +.T U 7 # 8.5.1.0.R ; ; R 0.l 6 R 7 l l Q 7 7 Q l ; ; Q R l l l l % l l l 7 +.U 6 U +.T +.+.+.+.U V + V V V + U + '.'.;.;.;.>.>. .;.).:.>. .^.).).:.^.^.:./.^.^./.^./.1.1.2.1.2.2.2.2.5.2.5.5.5.5.5.5.5.5.;.% $ 8.5.5.5.5.=.h 8 9 r ",
"            + l ( { d g : _ @.U T U U + 5.5.2.U T l % l R 7 R R T 7 7 R T R Q 7 7 R R Q l U T 7 7 U l ; 7 U 7 7 U U 6 +.V U +.U U U U '.'.U V V V U V '.+  .;.;. .>.:.).;.:.:.].].].:.^.^.^././.1.1.1.2.2.2.2.2.5.2.2.5.5.2.5.5.5.5.5.5.(.; $ ..5.5.5.5.1 h , 3 t.",
"            + =./ d ~ f 5 a @.U 7 U l +.5.g.1.T U 7 ; R 7 Q ; Q ; ; 7 l l ; % U l ; Q 7 7 l 7 l l 7 7 l 7 R 6 +.7 U +.+.+.U 1 +.U T U U U U '.V V V +.'.;.;.;.'.).).>.;. .].^.:.:.:.].^.].^.1.^./.1.2.2.2.2.5.2.2.5.2.5.5.5.5.5.5.5.5.5.~.; l x.5.2.5.5.].r ' 8 k ",
"            6.8 _ ~ p j b _ & V +.U l . g.5./.U U 7 Q T T *.Q 7 7 7 R l R 7 R T l 7 R 7 U T T Q l R 7 7 T U 7 7 T U V + V +.U U V +.+ V V V '.V V '.<.;.;. .;.;. .;.'. .).:.:.].].].].^.^.^.^.].^.1.2.2.2.2.2.5.2.5.5.5.5.5.5.5.2.5.5.5.>.; 6 W 5.5.5.5.2.,.4.H k ",
"            + 3 ^ d h t.M 4 Q V U U Q + 5.g./.U U l 7 Q R 7 7 R Q l l T 7 7 R R U U 0.R l R 0.R l U T l Q Q l U T 7 +.U U U U U V U U V X V U '.V V '.;.'.;.;.;.).>.;.>.:.^.].|.^.].]./.1./.|.^./.1.2.2.1.2.5.2.2.5.5.2.5.5.5.5.5.5.5.5.>.m.6 + 5.5.5.5.2.,.N % F ",
"            + 9 / d h h ( c -.U 7 U l  .5.2.~.T 0.l 6 R m.7 7 Q % ; R R 7 ; R T 7 T l l l T R U l T T l *.% $.= Q R 7 U T U T T U +.V '.+ + U V V '.V ;.;.<.;.'. .;.>.;.V V :.^.^.^./.^././.^.1.2.1.2.2.2.2.2.2.5.5.5.5.5.5.5.5.5.5.5.5.].l 7 @ g.5.5.5.5.9 N 8 k ",
"          . + ,.4 g g 5 _ _.-.1 1 U ; a.g.5.~.7 U U U R R 7 7 l Q % Q l 7 ; 7 T l l 7 7 l +.T 7 l 7 T ; - !.O ,.< ` 3 2 R 1 7 U R U +.U V V V + U 1 V '.'.'.'.6 Q O m k 4.3 # ^.].^.^.].^.1.1.2.2.2.2.2.2.5.5.2.2.5.2.5.5.5.5.5.5.5.5.5./.l # # 5.5.5.5.5.2 N 8 9 ",
"          + + A x g 5 ) _ b.-.6 7 l # 8.5.2.>.U U 7 7 R T l l U % ; T U 7 6 R R 7 +.U 7 l 7 T l 7 6 l z h.(.( _ b y.` [ , 8 8 8 I Q l V '.;.'.V U 7 l R 2 m m | 6.m A / _ ~ $ !./.].^.^././.^././.2.5.2.2.2.5.2.2.5.5.5.5.5.5.5.5.5.5.5./.l +.7 8.5.5.5.5.Y t 8 3 ",
"          - + [.c g f t _ 4.;.U T R +.1.5.5.;.T +.R Q Q l 7 7 Q 7 7 U U 7 U R U R T U +.l Q R ; +.U R l i.H z.z.r.u.@.2 = 9 j s k 9 9 }.O Q m.R O O % 9 r u * 8./.q z.r.z.a * ^./.^.^././.1.^.1.1.2.2.5.2.5.5.5.5.2.5.5.5.5.5.5.5.5.5.5.2.l +.$ 8.5.5.5.5.1 t m m ",
"          6.1 ( { h g i a ` ;.7 U U +.5.5.2.;.7 T T 7 T 7 7 l T l l 7 R l 7 U T ; U U 9.7 T Q l U T T l f.; o.r.s.A.o ` p.9 n.n.4 N $.9 9 $.2 % U V v ( B _.P &.C ' v.s.s.4 z 5.1.1./.^././.1.2.2.1.5.2.5.5.2.5.2.5.5.5.5.5.5.5.5.5.5.5.2.Q +.; ..5.5.5.5.W d [ 9 ",
"          . % _ f j g f a } '.7 7 T + 5.5.2.;.l R 7 7 R T l ; T 7 7 U R l % R 7 l ; R l 7 +.R l 7 U T 7 R H ' y.,.$.8 = '.q z.r.z.a , 3 &.> } % - B.o.z.z.u.Z &.; ;.=.,.' &.7.1.1.1./.1.^./.1.1.1.1.2.5.2.2.2.5.5.5.5.5.5.5.5.5.5.5.5.5.2.0.+ $ ..5.5.5.5.~.! 3 8 ",
"          + 2 ] _.h i j 4 * ;.U T Q + g.5.5.;.T R R l l T 7 R 0.T +.U R l ; R Q 7 U R U 7 T T +.T T R 7 R P R l +.<.<.T <.K C.o.v.] 4., m G H m m 3 q _ n.v.&.~.].^./.]./././.].^.^.1./.1.1.2.1.2.2.2.1.2.5.5.2.5.5.5.5.5.5.5.5.5.5.5.5.2.U +.$ W 5.5.5.5./.,.D.8 ",
"          + 2 / ) ~ ~ 5 _ & ;.7 T 7 W 5.5.2.V U V l 7 T 7 l T U +.U R 7 l Q T l l 7 R T 7 U T 7 l T T 6 R U U U U U V U U 2 ,.[ 8 l V ;. .;.V '.V U R G , > -.:.].:.:.1.1.^.^./././.1.^.1.1.2.1.2.2.2.2.5.5.5.5.5.2.5.5.5.5.5.5.5.5.5.5.2.0.@ 6 . 5.5.5.5.2.v [ H ",
"          + 9 / f d n e 4 S + U U T ..5.5.2.;.U U l 7 U l l ; U 7 R R 7 7 l l T U l T U 7 7 T l l k.T +.T S U T U U U U U U U V ;.;.'.'.'.W '.;.;.;.;.>.>.].;.).].:.:./.^.^.1.5.1./.1.1.1.^.5.2.2.2.2.5.2.5.5.2.5.5.5.2.5.5.5.5.5.5.5.5.2.V @ 1 @ 2.5.5.5.5.&.N = ",
"          . &.] t ~ p i d -.U +.+.T !.5.5.2.W R U l 7 T +.; % Q $ $ U 7 l 9.R 7 6 l l Y 7 Q l 7 7 +.7 U U U U +.+.U +.+.0.U V V V '.V '.;.'.'.'.;.).;.;. . . .).:.:.).).]././././.^.^./.1.1.2.2.1.5.5.5.5.2.2.5.5.5.5.5.5.5.5.5.5.5.5.5.5.V # # 7 5.5.5.5.5.$.' H ",
"        . + k ] ~ d h { _.'.U 7 U T !.5.5.2.U R T R l T T 7 7 R l k.U 0.R l Q R l l R l 7 7 l 7 U U R 6 U V T 7 U U 1 U V V +.V '.V '.;.'.+ '.;.;.).;.'.;.>.>.;. .).].a.:.^.^.^./.1.1.^.1.2.5.2.2.2.2.2.2.5.2.5.2.5.5.5.5.5.5.5.5.5.5.5.5.;.+ + $ 5.5.5.5.5.H D 8 ",
"        - + K ^ 5 c d _ c.7.U U R T 8.5.5.2.U R U 7 l R l T +.l % 7 T 7 7 Q R T ; T +.7 6 +.U U 6 T U 7 U U 7 U +.U +.U '.V + '.;.;.+ <.+ W  .;.'.).;.;. .).:.).!.:.:.^./.^.^.^.^.^.^.1.5.2.5.2.2.2.2.5.2.5.5.5.5.5.5.5.5.5.5.5.5.5.5.5.5.;.# + % 8.5.5.5.g.w.Z % ",
"        + + 3.] { d h 4 ` ;.U +.T +.l.5.5.2.U l U U l U T 7 R l U 6 7 R l 6 T Q U U T +.U l U R 7 7 7 l +.U +.+.U U +.+ '.V V V ;.'.;.'. . . .'.W  .;. . .;.:.).].:.:.^.1.1.^.^.].^./.1.1.2.2.5.2.2.2.5.5.5.5.5.5.5.5.5.5.5.5.5.5.5.5.5.2.~.@ W ; l.5.5.5.5.;.: = ",
"        . + r c g h h _ N ;.7 +.T +.i.5.5.2.U R R R 7 0.l l R V U 7 U R l l R Q +.U 0.7 7 U T 7 U R Q 7 7 T U 7 U V +.+.U V V '.V '.+ '.;. .'.'. . .;.;.>.:.>.:.:.:.:.^.].^./.^.^.^.1.1.1.2.1.2.2.5.5.2.5.5.5.5.5.5.5.5.5.5.5.5.5.5.5.5.5.~.6 W 7 !.5.5.5.5.>.g 8 ",
"        + 6 5 x ) h e a @.;.T +.R -.g.5.5./.R U R l 7 Q Q R R U T +.U R Q 7 U R 7 T R T l T R l 7 R 0.U 7 U U U U U V V U V + '.V + '.;.'.;.;.;. .;.>.>.).|.:.>.).>.:.^.^.^.^./.1.^././.1.2.1.5.5.5.5.5.2.5.5.5.5.5.5.5.5.5.5.5.5.5.5.5.5.~.7 W ; ..5.5.5.5.~.t = ",
"        - + 5 c 5 h i 4 D.<.7 T R f.5.5.2./.T T R T U 7 U l l Q l 6 R T T ; Q 7 6 U U R % R T 7 l U U +.T U V +.+.U U U '.+ +.V U '.+ ;.;. .:.:. .;.>.>.>.:.:.:.).:.^.^./.^./.^./.1./.^.1.2.2.2.5.5.5.5.5.5.5.2.5.5.5.5.5.5.5.5.5.5.5.5.2.).T + ; ..5.5.5.g.1.#.} ",
"        . 1 M c { t r _ & ;.7 +.+...5.2.5.^.l 7 l U l R T l l R 7 7 l U l $ 7 7 $ 6 T ; $ U U Y +.T 7 7 6 U 1 # l U 1 + + # + V '. .W  .;. .>. . .>.;.;. .:.>.a.:.^.>.).^.!./.^.^.2.1.1.2.1.1.5.2.2.5.2.5.5.2.5.5.5.5.5.5.5.5.5.5.5.5.5.5.~.7 W 6 - 5.5.5.5.2.,.@.",
"        . U b f { h h _ z '.U +.R  .5.5.5./.R U T +.T R 7 l R R R # U U U T T T 6 R U l 7 U T 7 +.0.U 7 U U +.1 U V +.+ '.W '.'.;.'.'.;.'. . .;.'.;.7.>.).;.:.].:.^.:.:./.1.].1.1.1.2.2.5.5.2.2.5.2.5.5.5.5.5.5.5.5.5.5.5.5.5.5.5.5.5.5.5.~.7 W +.k.g.5.5.5.2.9 @.",
"        . 9.] { { i A 4 S <.+.1 +.a.5.2.5.].R U V 7 7 R R R T R 7 # +.T U +.U T 7 T R R 7 U U 7 +.U U +.+.U 1 +.V V U +.'.+ 1 V '.+ + '.V  .7.;.;.'.;.>.).>.:.].).:.^.].^.^.].^.1.1.2.2.2.2.5.5.5.5.5.5.5.5.5.5.5.5.5.5.5.5.5.5.5.5.5.5.5.~.7 W + 7 2.5.5.5.5.m {.",
"        + *.] { { g [.x f.V +.1 +.!.5.5.5.~.6 U U 6 7 T R U +.R 6 T U l 7 6 T T U T 7 U 6 T +.7 U T 7 V V ;.'.'.'.'.W ;.'. .;.;.;. .'.V +  .;.;. .;.).|.^.^.^.].^.^.^.^./.].^.2.5.1.5.2.2.2.5.2.2.5.5.5.5.5.5.5.5.5.5.5.5.5.5.5.5.5.5.5.5.).l W + # 5.5.5.5.5.8 ' ",
"        - I ( d ~ j [.c  .V U U U h.5.5.5.].U U 0.7 U U l 7 U U 7 l 7 T 7 ; ; 7 7 ; R T l 6 U 7 U T +.V ^.5.2.1.;.'.^.1.>.^.2.5.2.5.2.^.:.1.].;.:.2.1.].5.2.^.^.].2.5.2./.^.^.2.5.2.2.2.5.2.5.2.5.5.5.2.5.5.5.5.5.5.5.5.5.5.5.5.5.5.5.5.5.].U . V 6 5.5.5.5.5.2 4.",
"        . H ] h 5 p M _.'.V U U U h.g.5.5.].U T U 7 U Q T U U U l l U R l % T 7 R R 9.U R R U 1 +.U + '.1.2.5.5.].<.1.2.1.5.5.2.1.1.5.5.1.5.2.^.5.2./.].2.5./.^.1.5.5.5.2./.1.1.2.1.2.2.5.5.2.5.5.5.5.5.5.5.5.5.5.5.5.5.5.5.5.5.5.5.5.5.5./.U .  .R i.5.5.5.5.l < ",
"        . 2 ] d ~ L M c.;.V U +.-.1.5.5.5.~.R U 0.R T 0.0.R 7 R l R R T l 7 U U l l U R U 0.U +.+.U '.'.1.5./.2.5.].1.2.1.2.2.>.:.].1.5.2.2.2.2.5.2.]./.2.5.1.^.5.2.2.2.5.2.1.1.1.2.5.2.2.5.5.2.2.5.5.5.5.5.5.5.5.5.5.5.5.5.5.5.5.5.5.5.5./.R W ;.l p.5.5.5.5.Y ' ",
"        - m _ { i t ( 4.:.V V U + 5.2.2.5.;.R U T R R U R 6 7 R 6 7 7 7 ; +.0.l Y l l ; 7 R U +.+.0.U V 8.2.:.!.5.5.5.2.1.5.2.].].].5.2.2.5.2.2.5.2.].].2.5.2.2.5.5.2.5.5.2.2.2.1.2.2.5.2.2.5.5.5.5.5.5.5.5.5.5.5.5.5.5.5.5.5.5.5.5.5.5.5./.Y .  .; ..5.5.5.5.V r ",
"        + F ( f p %.] N :.U V +.+ 5.2.2.5.>.T U U l R R 9.6 U 0.R l 7 l R l l T U l R l 7 +.V U + V U + 5.5.~.;.2.5.5.5.1.2.5.5.5.5.5.2./.5.2.].1.5.2.1.2.5.1.2.5.5.5.5.5.5.2./.1.1.1.2.2.2.5.2.5.5.5.5.5.5.5.5.5.5.5.5.5.5.5.5.5.5.5.5.5.2.U W 7.l ..5.5.5.5. .3.",
"        . F ] d t t ^ ` >.U + U W 5.2.5.5.>.U U V U U R U 9.0.T 7 l U T T 9.U U 7 l U l U V +.+.U U +.V ^.1.>.;.>.1.1./.].^.2.2.2.2.2.1.^.2.1.:.].1.5.2.1.2.1.5.2.2.2.2.2.2.1./.1.1.2.2.2.2.5.5.5.5.5.5.5.5.5.5.5.5.5.5.5.5.5.5.5.5.5.5.5.2.1 +  .7 x.5.5.5.5.~.%.",
"        . K ] f : L ( D.>.U V +.'.5.5.5.5.>.U 0.U U l R T +.9.U U U Q T V 7 R l 6 6 U U U V +.+.+.U V V ;.'.V '.V '. .>.;.;.:.:.^.:.:.:.:.:.>.:.].].^./.].^././.1.1././.1.2./.2.1.1.2.2.1.2.5.5.5.5.5.5.5.5.5.5.5.5.5.5.5.5.5.5.5.5.5.5.5.2.1 +  .+ ..5.5.5.5.~.,.",
"        + 3./ d j %.4 } ;.+.+.U ).5.2.5.2. .V U 0.U +.0.R 7 *.7 7 7 R l +.U U T 7 U U U U U +.1 U V V V V '.+.+ '.;.;.;.;.;.7.>.>.>.:.>.>.:.>.;.;.:.:.].:.:.^./.^./.1.1.1.1.5.2.2.1.2.2.2.5.5.5.5.5.5.5.5.5.5.5.5.5.5.5.5.5.5.5.5.5.5.5.5.2.V + ~.1 x.5.5.5.g.!.,.",
"        + q ] f f r d.& ;.T '.V  .5.2.5.5.>.U '.U U U V V U U 0.9.l +.T +.U T U U T U V V U V U V V +.U V + '.V V '.'.'.;. .;.;.;.;.>.>.>.>.>.:.:.:.:.^.].^.^.1.^.^.1.2.1.1.2.2.5.1.2.5.5.5.5.5.5.5.5.5.5.5.5.5.5.5.5.5.5.5.5.5.5.5.5.5.5.2.W + ).+ + 5.5.5.5.8.,.",
"        + %.] d u %.b z >.'.+ V ..5.2.5.5.;.U V U U +.9.T +.U U U l U U U 6 U U +.U U 9.U U V U U V U + '.V V '.V '.+ ;.<.'.;.;.>.>.>.>.>.:.:.>.>.].^.].].^.^./.1.1.1././.1.1.1.2.2.2.2.2.5.2.5.5.5.5.5.5.5.5.5.5.5.5.5.5.5.5.5.5.5.5.5.5.2.V W ).U @ g.5.5.5.2.9 ",
"        + q c ~ p j c k.;.'.'.U !.5.2.2.5.>.V V 0.R 6 U 0.Y 7 U U +.+.U 1 7 U U +.+.T U R V V V V V ;.;.;.;.).>.].>.].:.].>.].].^.].]././././.].1./.1.1.2.2.5.2.2.2.2.5.2.2.2.5.2.2.2.2.2.5.2.5.5.5.5.5.5.5.5.5.5.5.5.5.5.5.5.5.5.5.5.5.5.2.V 1  .1 # g.5.5.5.2.9 ",
"        + q { g u L c k.;.'.U U !.5.2.5.2.;.U U T R 7 +.T U U U U V U U 1 V ;.;.W ;.;.>. .>.;.V V V V R P }.= = }.} 3 3 @.9 9 9 9 , , , 9 k @., , , @.3 3 8 } & & z # + f.x...l.5.5.5.5.5.5.5.5.5.5.5.5.5.5.5.5.5.5.5.5.5.5.5.5.5.5.5.5.5.2.V 1  .+ $ g.5.5.5.2.m ",
"        1 i d ) ) n b - ;.'.+ +.!.5.5.5.5.;.U U V T +.U V V V ;.>.<.;.V V U % = 8 3 k ` 4.: s ~ c ] _ ( / / ^ E { E.E.E.x E.E 4 / / / / / / / / B B B B B B B _ _ _ ^ ^ ] 4 4 ^ b ~ Z < y &.> C | - x.l.2.g.5.5.5.5.5.5.5.5.5.5.5.5.5.5.5.2.V +  .+ 6 2.5.5.5.2.= ",
"        1 i g d j 3.~ f.;.'.+ +.h.5.5.5.5.>.U U '.;.>.<.V O 2 = k ,.#.{ _ _ _ _ / / E E E E.E.F.F.F.G.H.H.H.H.H.H.I.H.I.I.H.H.H.H.H.H.H.H.H.H.H.H.H.H.H.H.H.H.H.H.H.H.H.H.G.G.F.G.F.F.F.F.F.F.F.E.E.E.f f s < &.> & w - !.2.2.g.5.5.5.5.5.2.U 1 ).;.6 g.5.5.5.5.H ",
"        U 5 ~ s g h D 7.'.'.'.+ h.5.2.5.5.>.V '.<.=.,.{ _ v.n.n.o.A.v._ E F.G.H.H.H.J.J.J.J.I.I.I.I.I.I.I.I.I.I.I.I.I.I.I.I.K.I.I.I.I.I.I.I.I.I.J.I.I.I.I.J.I.I.I.I.I.I.I.I.I.I.I.I.I.I.I.I.I.J.J.H.H.H.H.G.G.E.E.E.E E { ~ ' [ } ..5.5.5.2.V @ ).W # 5.5.5.5.5.% ",
"        Y b d h : i b.7.V '.V + 2.5.2.5.2.;.+ ;.9 B C.o.v._ E E.F.G.H.J.J.J.I.I.I.K.I.I.I.I.I.I.I.I.I.I.I.I.I.I.I.I.I.I.I.I.I.I.I.I.I.I.I.I.I.I.I.I.I.I.I.I.I.I.I.I.I.I.I.I.I.I.I.I.I.I.I.I.I.I.I.I.K.I.I.I.I.J.J.J.H.H.G.G.F.E B ] | 5.5.2.;.1  .+ # 2.5.5.5.2.% ",
"        # 5 { { %.,.c.).V '.U + 5.5.2.5.5.<.;.G o.A.E.G.H.H.J.J.J.J.I.I.K.I.I.I.I.I.I.I.I.I.I.I.I.I.I.I.I.I.I.I.I.I.I.I.I.I.I.I.I.I.I.I.I.I.I.I.I.I.I.I.I.I.I.I.I.I.I.I.I.I.I.I.I.I.I.I.I.I.I.I.I.I.I.I.I.I.I.I.I.I.K.I.I.J.J.H.H.E _ $ 5.2.V #  .V 7 8.5.5.5.5.; ",
"        *.{ 5 d : %.c.a.'.;.V W 5.2.5.5.5.>.V [.o.G.J.J.J.I.I.I.K.I.I.I.I.I.I.I.I.I.I.I.I.I.I.I.I.I.I.I.I.I.I.I.I.I.I.I.I.I.I.I.I.I.I.I.I.I.I.I.I.I.I.I.I.I.I.I.I.I.I.I.I.I.I.I.I.I.I.I.I.I.I.I.I.I.I.I.I.I.I.I.I.I.I.I.I.I.I.I.J.H.E _.i.2.+ #  .;.6 l.5.5.5.5.6 ",
"        =.{ 5 { j r N |.U V +  .5.5.2.5.5.].I v.F.J.I.K.I.I.I.I.I.I.I.I.I.I.I.I.I.I.I.I.I.I.I.I.I.I.I.I.I.I.I.I.I.I.I.I.I.I.I.I.I.I.I.I.I.I.I.I.I.I.I.I.I.I.I.I.I.I.I.I.I.I.I.I.I.I.I.I.I.I.I.I.I.I.I.I.I.I.I.I.I.I.I.I.I.I.I.I.K.J.G.x - 5.;.1  . .U p.5.5.5.5.Y ",
"        *.{ i j ' 4.N ].'.'.+ f.2.5.2.5.2.].G B H.J.I.I.I.I.I.I.I.I.I.I.I.I.I.I.I.I.I.I.I.I.I.I.I.I.I.I.I.I.I.I.I.I.I.I.I.I.I.I.I.I.I.I.I.I.I.I.I.I.I.I.I.I.I.I.I.I.I.I.I.I.I.I.I.I.I.I.I.I.I.I.I.I.I.I.I.I.I.I.I.I.I.I.I.I.I.I.I.I.H._ | 2.V 1  .. 6 l.5.5.5.5.U ",
"        =.{ i ! N t N :.+ ;.V + g.5.5.5.5.].G _ H.J.I.I.I.I.I.I.I.I.I.I.I.I.I.I.I.I.I.I.I.I.I.I.I.I.I.I.I.I.I.I.I.I.I.I.I.I.I.I.I.I.I.I.I.I.I.I.I.I.I.I.I.I.I.I.I.I.I.I.I.I.I.I.I.I.I.I.I.I.I.I.I.I.I.I.I.I.I.I.I.I.I.I.I.I.I.I.I.K.H.E D.g.V #  .+ 6 ..5.5.5.5.+ ",
"        =.{ d ~ < d @.>.+ ;.U + 5.5.2.5.5.].9 / H.I.I.I.I.I.I.I.I.I.I.I.I.I.I.I.I.I.I.I.I.I.I.I.I.I.I.I.I.I.I.I.I.I.I.I.I.I.I.I.I.I.I.I.I.I.I.I.I.I.I.I.I.I.I.I.I.I.I.I.I.I.I.I.I.I.I.I.I.I.I.I.I.I.I.I.I.I.I.I.I.I.I.I.I.I.I.I.I.I.H.E D.5.V @  .W 6 ..g.5.5.5.W ",
"        I 5 d ~ < e @.:.;.'.V f.2.5.5.5.5.].F 4 J.I.I.I.I.I.I.I.I.I.I.I.I.I.I.I.I.I.I.I.I.I.I.I.I.I.I.I.I.I.I.I.I.I.I.I.I.I.I.I.I.I.I.I.I.I.I.I.I.I.I.I.I.I.I.I.I.I.I.I.I.I.I.I.I.I.I.I.I.I.I.I.I.I.I.I.I.I.I.I.I.I.I.I.I.I.I.I.I.I.J.E.{.g.V #  . .@ j.5.5.5.5.W ",
"        =.b q ) ' d @.>.+ '.+  .g.2.2.2.2.>.K E J.K.I.I.I.I.I.I.I.I.I.I.I.I.I.I.I.I.I.I.I.I.I.I.I.I.I.I.I.I.I.I.I.I.I.I.I.I.I.I.I.I.I.I.I.I.I.I.I.I.I.I.I.I.I.I.I.I.I.I.I.I.I.I.I.I.I.I.I.I.I.I.I.I.I.I.I.I.I.I.I.I.I.I.I.I.I.I.I.K.J.E.{.2.1 @ W W 6 . 5.5.5.5.W ",
"        }.d g g ' d.@.;.V ;.V 7.2.5.2.5.5.>.%.E.J.I.I.I.I.I.I.I.I.I.I.I.I.I.I.I.I.I.I.I.I.I.I.I.I.I.I.I.I.I.I.I.I.I.I.I.I.I.I.I.I.I.I.I.I.I.I.I.I.I.I.I.I.I.I.I.I.I.I.I.I.I.I.I.I.I.I.I.I.I.I.I.I.I.I.I.I.I.I.I.I.I.I.I.I.I.I.I.I.I.J.E.N g.+ @  .W 6 j.5.5.5.5.W ",
"        H M e g #.M D.:.'.'.V W 5.2.2.5.5.>.K F.J.I.I.I.I.I.I.I.I.I.I.I.I.I.I.I.I.I.I.I.I.I.I.I.I.I.I.I.I.I.I.I.I.I.I.I.I.I.I.I.I.I.I.I.I.I.I.I.I.I.I.I.I.I.I.I.I.I.I.I.I.I.I.I.I.I.I.I.I.I.I.I.I.I.I.I.I.I.I.I.I.I.I.I.I.I.I.I.I.I.J.F.N 5.V # W W U @ 5.5.5.5.e.",
"        H d e g 4.d.} >.'.'.V 7.5.5.2.2.5.>.K F.J.K.I.I.I.I.I.I.I.I.I.I.I.I.I.I.I.I.I.I.I.I.I.I.I.I.I.I.I.I.I.I.I.I.I.I.I.I.I.I.I.I.I.I.I.I.I.I.I.I.I.I.I.I.I.I.I.I.I.I.I.I.I.I.I.I.I.I.I.I.I.I.I.I.I.I.I.I.I.I.I.I.I.I.I.I.I.I.I.K.J.F.N 2.1 6.W  .1 - 5.5.5.5.~.",
"        8 d h f < d.} >.V ;.V ).5.5.2.5.2.>.%.F.J.I.I.I.I.I.I.I.I.I.I.I.I.I.I.I.I.I.I.I.I.I.I.I.I.I.I.I.I.I.I.I.I.I.I.I.I.I.I.I.I.I.I.I.I.I.I.I.I.I.I.I.I.I.I.I.I.I.I.I.I.I.I.I.I.I.I.I.I.I.I.I.I.I.I.I.I.I.I.I.I.I.I.I.I.I.I.I.I.I.J.F.N 2.U @  .W # . 5.5.5.2...",
"        2 { { g L d.* ;.'.'.U ..5.5.2.5.5.>.%.F.J.I.I.I.I.I.I.I.I.I.I.I.I.I.I.I.I.I.I.I.I.I.I.I.I.I.I.I.I.I.I.I.I.I.I.I.I.I.I.I.I.I.I.I.I.I.I.I.I.I.I.I.I.I.I.I.I.I.I.I.I.I.I.I.I.I.I.I.I.I.I.I.I.I.I.I.I.I.I.I.I.I.I.I.I.I.I.I.I.I.J.F.L.2.1 + W + 6 - 5.5.5.5.~.",
"        2 ] e : [ d.& '.+ ;.'...5.5.5.5.5.].q F.J.K.I.I.I.I.I.I.I.I.I.I.I.I.I.I.I.I.I.I.I.I.I.I.I.I.I.I.I.I.I.I.I.I.I.I.I.I.I.I.I.I.I.I.I.I.I.I.I.I.I.I.I.I.I.I.I.I.I.I.I.I.I.I.I.I.I.I.I.I.I.I.I.I.I.I.I.I.I.I.I.I.I.I.I.I.I.I.I.I.J.F.L.2.V @ + W + . 5.5.5.5.e.",
"        = { d h , r P ;.;.'.+ 7.g.2.2.5.5.>.q F.J.I.I.I.I.I.I.I.I.I.I.I.I.I.I.I.I.I.I.I.I.I.I.I.I.I.I.I.I.I.I.I.I.I.I.I.I.I.I.I.I.I.I.I.I.I.I.I.I.I.I.I.I.I.I.I.I.I.I.I.I.I.I.I.I.I.I.I.I.I.I.I.I.I.I.I.I.I.I.I.I.I.I.I.I.I.I.I.I.I.J.G.L.5.V @ W  .1 - 5.5.5.5./.",
"        8 { e d ` 4.z ;.'.;.+ a.5.5.2.2.2.>.0 G.J.I.I.I.I.I.I.I.I.I.I.I.I.I.I.I.I.I.I.I.I.I.I.I.I.I.I.I.I.I.I.I.I.I.I.I.I.I.I.I.I.I.I.I.I.I.I.I.I.I.I.I.I.I.I.I.I.I.I.I.I.I.I.I.I.I.I.I.I.I.I.I.I.I.I.I.I.I.I.I.I.I.I.I.I.I.I.I.I.I.I.G.L.2.1 @ W W + . 5.5.5.5./.",
"        $.f g f 4.D z >.;.'.+ !.5.5.5.5.5.].%.G.J.I.I.I.I.I.I.I.I.I.I.I.I.I.I.I.I.I.I.I.I.I.I.I.I.I.I.I.I.I.I.I.I.I.I.I.I.I.I.I.I.I.I.I.I.I.I.I.I.I.I.I.I.I.I.I.I.I.I.I.I.I.I.I.I.I.I.I.I.I.I.I.I.I.I.I.I.I.I.I.I.I.I.I.I.I.I.I.I.I.I.G.L.1.U @ W W W . 5.5.5.5./.",
"        9 f h h ` c.z ;.'.;.V !.5.2.2.2.5./.K G.J.I.I.I.I.I.I.I.I.I.I.I.I.I.I.I.I.I.I.I.I.I.I.I.I.I.I.I.I.I.I.I.I.I.I.I.I.I.I.I.I.I.I.I.I.I.I.I.I.I.I.I.I.I.I.I.I.I.I.I.I.I.I.I.I.I.I.I.I.I.I.I.I.I.I.I.I.I.I.I.I.I.I.I.I.I.I.I.I.I.I.G.L.2.1 6. .W + . 5.5.5.5.2.",
"        9 c h 0 , t P >.'.'.'.!.5.2.2.5.5.~.t.G.J.I.I.I.I.I.I.I.I.I.I.I.I.I.I.I.I.I.I.I.I.I.I.I.I.I.I.I.I.I.I.I.I.I.I.I.I.I.I.I.I.I.I.I.I.I.I.I.I.I.I.I.I.I.I.I.I.I.I.I.I.I.I.I.I.I.I.I.I.I.I.I.I.I.I.I.I.I.I.I.I.I.I.I.I.I.I.I.I.I.J.G.L.1.1 1 W ~.. x.5.5.5.5.2.",
"        9 { q q ,.D z ;.;.'.+ ).5.5.2.5.2.~.0 G.J.I.I.I.I.I.I.I.I.I.I.I.I.I.I.I.I.I.I.I.I.I.I.I.I.I.I.I.I.I.I.I.I.I.I.I.I.I.I.I.I.I.I.I.I.I.I.I.I.I.I.I.I.I.I.I.I.I.I.I.I.I.I.I.I.I.I.I.I.I.I.I.I.I.I.I.I.I.I.I.I.I.I.I.I.I.I.I.I.I.I.G.L.1.U + ;.W 1 . 5.5.5.2.2.",
"        3 f : p 4.D k.>.'.'.V !.5.5.2.5.5.~.0 G.J.I.I.I.I.I.I.I.I.I.I.I.I.I.I.I.I.I.I.I.I.I.I.I.I.I.I.I.I.I.I.I.I.I.I.I.I.I.I.I.I.I.I.I.I.I.I.I.I.I.I.I.I.I.I.I.I.I.I.I.I.I.I.I.I.I.I.I.I.I.I.I.I.I.I.I.I.I.I.I.I.I.I.I.I.I.I.I.I.I.I.G.L.8.6 +  .W 6 . 5.5.5.5.2.",
"        9 b n p < N S ;.'.'.+ a.5.2.2.5.5.e.t.G.I.I.I.I.I.I.I.I.I.I.I.I.I.I.I.I.I.I.I.I.I.I.I.I.I.I.I.I.I.I.I.I.I.I.I.I.I.I.I.I.I.I.I.I.I.I.I.I.I.I.I.I.I.I.I.I.I.I.I.I.I.I.I.I.I.I.I.I.I.I.I.I.I.I.I.I.I.I.I.I.I.I.I.I.I.I.I.I.I.I.I.G.L.2.# +  .W 1 j.5.5.5.5.2.",
"        m b ~ : [ c.Q '.'.'.V a.5.2.2.2.5./.%.G.I.I.I.I.I.I.I.I.I.I.I.I.I.I.I.I.I.I.I.I.I.I.I.I.I.I.I.I.I.I.I.I.I.I.I.I.I.I.I.I.I.I.I.I.I.I.I.I.I.I.I.I.I.I.I.I.I.I.I.I.I.I.I.I.I.I.I.I.I.I.I.I.I.I.I.I.I.I.I.I.I.I.I.I.I.I.I.I.I.I.I.G.L.8.1 +  .W 1 x.5.5.5.5.2.",
"        9 ] j t y b.T ;.+ '.+ !.5.5.2.5.5.~.r G.I.I.I.I.I.I.I.I.I.I.I.I.I.I.I.I.I.I.I.I.I.I.I.I.I.I.I.I.I.I.I.I.I.I.I.I.I.I.I.I.I.I.I.I.I.I.I.I.I.I.I.I.I.I.I.I.I.I.I.I.I.I.I.I.I.I.I.I.I.I.I.I.I.I.I.I.I.I.I.I.I.I.I.I.I.I.I.I.I.I.J.G.L.1.6 . W W # . 5.5.5.2.2.",
"        8 ] p ' 3.b.S '.;.;.+ a.5.2.2.5.5./.,.G.I.I.I.I.I.I.I.I.I.I.I.I.I.I.I.I.I.I.I.I.I.I.I.I.I.I.I.I.I.I.I.I.I.I.I.I.I.I.I.I.I.I.I.I.I.I.I.I.I.I.I.I.I.I.I.I.I.I.I.I.I.I.I.I.I.I.I.I.I.I.I.I.I.I.I.I.I.I.I.I.I.I.I.I.I.I.I.I.I.I.I.G.L.8.6.. W W @ x.5.5.5.5.2.",
"        m d h s [ b.S ;.'.;.V a.g.5.2.2.5.e.3.G.I.I.I.I.I.I.I.I.I.I.I.I.I.I.I.I.I.I.I.I.I.I.I.I.I.I.I.I.I.I.I.I.I.I.I.I.I.I.I.I.I.I.I.I.I.I.I.I.I.I.I.I.I.I.I.I.I.I.I.I.I.I.I.I.I.I.I.I.I.I.I.I.I.I.I.I.I.I.I.I.I.I.I.I.I.I.I.I.I.I.I.G.L./.1 .  .W @ j.5.5.5.5.2.",
"        8 d t Z 3.c.S  .'.;.+ a.5.5.2.5.5./.K G.J.I.I.I.I.I.I.I.I.I.I.I.I.I.I.I.I.I.I.I.I.I.I.I.I.I.I.I.I.I.I.I.I.I.I.I.I.I.I.I.I.I.I.I.I.I.I.I.I.I.I.I.I.I.I.I.I.I.I.I.I.I.I.I.I.I.I.I.I.I.I.I.I.I.I.I.I.I.I.I.I.I.I.I.I.I.I.I.I.I.J.G.N ^.1 W ;...1 x.5.5.5.5.2.",
"        H d j : v D -.;.'.'.'.a.5.5.2.5.5.e.K G.J.I.I.I.I.I.I.I.I.I.I.I.I.I.I.I.I.I.I.I.I.I.I.I.I.I.I.I.I.I.I.I.I.I.I.I.I.I.I.I.I.I.I.I.I.I.I.I.I.I.I.I.I.I.I.I.I.I.I.I.I.I.I.I.I.I.I.I.I.I.I.I.I.I.I.I.I.I.I.I.I.I.I.I.I.I.I.I.I.I.I.G.N /.1 W W W @ e.5.5.5.5.2.",
"        = { h ' ,.c.S ).'.'.V ).5.5.2.5.5.2.k F.J.I.I.I.I.I.I.I.I.I.I.I.I.I.I.I.I.I.I.I.I.I.I.I.I.I.I.I.I.I.I.I.I.I.I.I.I.I.I.I.I.I.I.I.I.I.I.I.I.I.I.I.I.I.I.I.I.I.I.I.I.I.I.I.I.I.I.I.I.I.I.I.I.I.I.I.I.I.I.I.I.I.I.I.I.I.I.I.I.I.I.G.{.!.1 W W W + l.5.5.5.5.2.",
"        H { i t K D S ;. .;.V 7.g.5.5.2.5.2.9 F.J.I.I.I.I.I.I.I.I.I.I.I.I.I.I.I.I.I.I.I.I.I.I.I.I.I.I.I.I.I.I.I.I.I.I.I.I.I.I.I.I.I.I.I.I.I.I.I.I.I.I.I.I.I.I.I.I.I.I.I.I.I.I.I.I.I.I.I.I.I.I.I.I.I.I.I.I.I.I.I.I.I.I.I.I.I.I.I.I.I.I.G.{.!.6 .  ...1 p.5.5.5.5.2.",
"        8 d h ~ ,.c.-.;.'.<.'. .5.5.5.2.5.2.9 F.J.K.I.I.I.I.I.I.I.I.I.I.I.I.I.I.I.I.I.I.I.I.I.I.I.I.I.I.I.I.I.I.I.I.I.I.I.I.I.I.I.I.I.I.I.I.I.I.I.I.I.I.I.I.I.I.I.I.I.I.I.I.I.I.I.I.I.I.I.I.I.I.I.I.I.I.I.I.I.I.I.I.I.I.I.I.I.I.I.I.I.G.{.!.1 W W W # !.g.5.5.5.2.",
"        H b q p 9 4.-.>.;.'.+  .2.5.2.5.5.2.9 F.J.I.I.I.I.I.I.I.I.I.I.I.I.I.I.I.I.I.I.I.I.I.I.I.I.I.I.I.I.I.I.I.I.I.I.I.I.I.I.I.I.I.I.I.I.I.I.I.I.I.I.I.I.I.I.I.I.I.I.I.I.I.I.I.I.I.I.I.I.I.I.I.I.I.I.I.I.I.I.I.I.I.I.I.I.I.I.I.I.I.J.G.D.~.6 +  .W # 8.5.5.5.5./.",
"        2 d j p k c.S >.'.'.'. .g.5.2.5.5.2.m E.J.I.I.I.I.I.I.I.I.I.I.I.I.I.I.I.I.I.I.I.I.I.I.I.I.I.I.I.I.I.I.I.I.I.I.I.I.I.I.I.I.I.I.I.I.I.I.I.I.I.I.I.I.I.I.I.I.I.I.I.I.I.I.I.I.I.I.I.I.I.I.I.I.I.I.I.I.I.I.I.I.I.I.I.I.I.I.I.I.I.J.G.*  .$ + W W 1 g.5.5.5.5./.",
"        =.b p ' k c.-. .'.;.;.+ 5.5.2.2.5.5.H E.J.K.I.I.I.I.I.I.I.I.I.I.I.I.I.I.I.I.I.I.I.I.I.I.I.I.I.I.I.I.I.I.I.I.I.I.I.I.I.I.I.I.I.I.I.I.I.I.I.I.I.I.I.I.I.I.I.I.I.I.I.I.I.I.I.I.I.I.I.I.I.I.I.I.I.I.I.I.I.I.I.I.I.I.I.I.I.I.I.I.J.F.* ~.w . W W # g.5.5.5.5.e.",
"        % ] i %.k c.S >.'.;.'.;.2.5.2.2.5.5.G E.H.I.I.I.I.I.I.I.I.I.I.I.I.I.I.I.I.I.I.I.I.I.I.I.I.I.I.I.I.I.I.I.I.I.I.I.I.I.I.I.I.I.I.I.I.I.I.I.I.I.I.I.I.I.I.I.I.I.I.I.I.I.I.I.I.I.I.I.I.I.I.I.I.I.I.I.I.I.I.I.I.I.I.I.I.I.I.I.I.I.J.F.* ;.@ W W . # g.5.5.5.5./.",
"        2 5 g 0 [ c.S >.;.;.'.;.2.5.5.5.5.5.I E.H.I.I.I.I.I.I.I.I.I.I.I.I.I.I.I.I.I.I.I.I.I.I.I.I.I.I.I.I.I.I.I.I.I.I.I.I.I.I.I.I.I.I.I.I.I.I.I.I.I.I.I.I.I.I.I.I.I.I.I.I.I.I.I.I.I.I.I.I.I.I.I.I.I.I.I.I.I.I.I.I.I.I.I.I.I.I.I.I.K.J.o | V .  .W + + g.5.5.5.g./.",
"        =.{ j ' [ c.k.>.;.;.'. .5.5.5.2.5.5.=.{ H.I.I.I.I.I.I.I.I.I.I.I.I.I.I.I.I.I.I.I.I.I.I.I.I.I.I.I.I.I.I.I.I.I.I.I.I.I.I.I.I.I.I.I.I.I.I.I.I.I.I.I.I.I.I.I.I.I.I.I.I.I.I.I.I.I.I.I.I.I.I.I.I.I.I.I.I.I.I.I.I.I.I.I.I.I.I.I.I.I.J.F.z W .  . .W + 5.5.5.5.5.!.",
"        =.e h u ,.b.z ;.;.'.;.'.5.5.2.2.5.5.J { H.I.I.I.I.I.I.I.I.I.I.I.I.I.I.I.I.I.I.I.I.I.I.I.I.I.I.I.I.I.I.I.I.I.I.I.I.I.I.I.I.I.I.I.I.I.I.I.I.I.I.I.I.I.I.I.I.I.I.I.I.I.I.I.I.I.I.I.I.I.I.I.I.I.I.I.I.I.I.I.I.I.I.I.I.I.I.I.I.I.H.o k.W . . W + . 5.5.5.5.5.e.",
"        % h %.j ' b.z ].;.;.;.'.^.5.5.2.5.5.1 g H.I.I.I.I.I.I.I.I.I.I.I.I.I.I.I.I.I.I.I.I.I.I.I.I.I.I.I.I.I.I.I.I.I.I.I.I.I.I.I.I.I.I.I.I.I.I.I.I.I.I.I.I.I.I.I.I.I.I.I.I.I.I.I.I.I.I.I.I.I.I.I.I.I.I.I.I.I.I.I.I.I.I.I.I.I.I.I.I.I.H.x - W . W W W . 5.5.5.5.5.e.",
"        6 A j L 9 c.& ].;.;.'.;./.5.2.2.2.5.;.q G.I.I.I.I.I.I.I.I.I.I.I.I.I.I.I.I.I.I.I.I.I.I.I.I.I.I.I.I.I.I.I.I.I.I.I.I.I.I.I.I.I.I.I.I.I.I.I.I.I.I.I.I.I.I.I.I.I.I.I.I.I.I.I.I.I.I.I.I.I.I.I.I.I.I.I.I.I.I.I.I.I.I.I.I.I.I.I.I.I.H._.- + . W  .;...5.5.5.5.5...",
"        U j t p ,.b.* ].'.;.;.;.^.5.5.2.2.5.;.A G.I.I.I.I.I.I.I.I.I.I.I.I.I.I.I.I.I.I.I.I.I.I.I.I.I.I.I.I.I.I.I.I.I.I.I.I.I.I.I.I.I.I.I.I.I.I.I.I.I.I.I.I.I.I.I.I.I.I.I.I.I.I.I.I.I.I.I.I.I.I.I.I.I.I.I.I.I.I.I.I.I.I.I.I.I.I.I.I.I.G._.+ 1 M.W ).W ..5.5.5.5.5. .",
"        6 h ! ) ,.r } ^.;.;.;.;.a.5.2.2.5.5.~.%.G.J.I.I.I.I.I.I.I.I.I.I.I.I.I.I.I.I.I.I.I.I.I.I.I.I.I.I.I.I.I.I.I.I.I.I.I.I.I.I.I.I.I.I.I.I.I.I.I.I.I.I.I.I.I.I.I.I.I.I.I.I.I.I.I.I.I.I.I.I.I.I.I.I.I.I.I.I.I.I.I.I.I.I.I.I.I.I.I.I.G.L.. + . W !.+ l.5.5.5.5.5.W ",
"        6 h h ~ N 4.D.].;.;.+ '.a.5.5.2.2.5.].%.G.J.I.I.I.I.I.I.I.I.I.I.I.I.I.I.I.I.I.I.I.I.I.I.I.I.I.I.I.I.I.I.I.I.I.I.I.I.I.I.I.I.I.I.I.I.I.I.I.I.I.I.I.I.I.I.I.I.I.I.I.I.I.I.I.I.I.I.I.I.I.I.I.I.I.I.I.I.I.I.I.I.I.I.I.I.I.I.I.I.G.N  .W W . ..+ p.5.5.5.5.5.W ",
"        U q b.) ` ,.@./.'.;.;.'.!.5.5.2.2.5./.K G.J.I.I.I.I.I.I.I.I.I.I.I.I.I.I.I.I.I.I.I.I.I.I.I.I.I.I.I.I.I.I.I.I.I.I.I.I.I.I.I.I.I.I.I.I.I.I.I.I.I.I.I.I.I.I.I.I.I.I.I.I.I.I.I.I.I.I.I.I.I.I.I.I.I.I.I.I.I.I.I.I.I.I.I.I.I.I.I.J.G.` '.+ W  .).+ g.5.5.5.5.2.6 ",
"        U j h p ` v ` |.;.;.;.;. .5.2.2.2.5.2.[ F.J.I.I.I.I.I.I.I.I.I.I.I.I.I.I.I.I.I.I.I.I.I.I.I.I.I.I.I.I.I.I.I.I.I.I.I.I.I.I.I.I.I.I.I.I.I.I.I.I.I.I.I.I.I.I.I.I.I.I.I.I.I.I.I.I.I.I.I.I.I.I.I.I.I.I.I.I.I.I.I.I.I.I.I.I.I.I.I.J.G.{.V + M.W  .6.g.5.5.5.5.5.; ",
"        1 j ~ ! 4.[ ` |. .;.'.'. .5.2.2.2.5.5.9 E.J.I.I.I.I.I.I.I.I.I.I.I.I.I.I.I.I.I.I.I.I.I.I.I.I.I.I.I.I.I.I.I.I.I.I.I.I.I.I.I.I.I.I.I.I.I.I.I.I.I.I.I.I.I.I.I.I.I.I.I.I.I.I.I.I.I.I.I.I.I.I.I.I.I.I.I.I.I.I.I.I.I.I.I.I.I.I.I.J.F.D.+ W W W ..1 g.5.5.5.5.5.% ",
"        1 n p : ! , c.a.;.;.V + ;.5.5.2.2.5.5.m E.H.I.I.I.I.I.I.I.I.I.I.I.I.I.I.I.I.I.I.I.I.I.I.I.I.I.I.I.I.I.I.I.I.I.I.I.I.I.I.I.I.I.I.I.I.I.I.I.I.I.I.I.I.I.I.I.I.I.I.I.I.I.I.I.I.I.I.I.I.I.I.I.I.I.I.I.I.I.I.I.I.I.I.I.I.I.I.I.J.F.D.;.W + + W W g.5.5.5.5.2.= ",
"        + r g p : 4.Z 7.>.'.;.'.;.1.5.5.2.5.2.8 E.H.I.I.I.I.I.I.I.I.I.I.I.I.I.I.I.I.I.I.I.I.I.I.I.I.I.I.I.I.I.I.I.I.I.I.I.I.I.I.I.I.I.I.I.I.I.I.I.I.I.I.I.I.I.I.I.I.I.I.I.I.I.I.I.I.I.I.I.I.I.I.I.I.I.I.I.I.I.I.I.I.I.I.I.I.I.I.I.J.x 3  . .W W W W 5.5.5.5.5.2.m ",
"        + r d ) g ,.b.-.;.'. .;.;.1.5.2.2.2.5.=.{ H.I.I.I.I.I.I.I.I.I.I.I.I.I.I.I.I.I.I.I.I.I.I.I.I.I.I.I.I.I.I.I.I.I.I.I.I.I.I.I.I.I.I.I.I.I.I.I.I.I.I.I.I.I.I.I.I.I.I.I.I.I.I.I.I.I.I.I.I.I.I.I.I.I.I.I.I.I.I.I.I.I.I.I.I.I.I.I.H.f & W W W W + ..5.5.5.5.5.2.k ",
"        1 r f ~ %.,.b.k.>.V '.'.'.!.5.2.2.5.5.9.0 H.I.I.I.I.I.I.I.I.I.I.I.I.I.I.I.I.I.I.I.I.I.I.I.I.I.I.I.I.I.I.I.I.I.I.I.I.I.I.I.I.I.I.I.I.I.I.I.I.I.I.I.I.I.I.I.I.I.I.I.I.I.I.I.I.I.I.I.I.I.I.I.I.I.I.I.I.I.I.I.I.I.I.I.I.I.I.I.H.o z W  .M.W + p.2.5.5.5.5.e.' ",
"        1 q d s ' ,.~ k.:.'.'.+ '...5.2.2.2.5.;.0 G.I.I.I.I.I.I.I.I.I.I.I.I.I.I.I.I.I.I.I.I.I.I.I.I.I.I.I.I.I.I.I.I.I.I.I.I.I.I.I.I.I.I.I.I.I.I.I.I.I.I.I.I.I.I.I.I.I.I.I.I.I.I.I.I.I.I.I.I.I.I.I.I.I.I.I.I.I.I.I.I.I.I.I.I.I.I.I.G.L.$ W W W  .1 !.5.5.5.5.5.!.' ",
"        + %.d p : 3._.* ].X '.'.V ).5.5.5.2.5.>.p H.J.I.I.I.I.I.I.I.I.I.I.I.I.I.I.I.I.I.I.I.I.I.I.I.I.I.I.I.I.I.I.I.I.I.I.I.I.I.I.I.I.I.I.I.I.I.I.I.I.I.I.I.I.I.I.I.I.I.I.I.I.I.I.I.I.I.I.I.I.I.I.I.I.I.I.I.I.I.I.I.I.I.I.I.I.I.I.G.L.7 ;.W ..).+ 8.5.5.5.5.g.~.' ",
"        + K f u p ,.4.D./.<.+.'.'.).5.2.2.2.5./.q G.J.I.I.I.I.I.I.I.I.I.I.I.I.I.I.I.I.I.I.I.I.I.I.I.I.I.I.I.I.I.I.I.I.I.I.I.I.I.I.I.I.I.I.I.I.I.I.I.I.I.I.I.I.I.I.I.I.I.I.I.I.I.I.I.I.I.I.I.I.I.I.I.I.I.I.I.I.I.I.I.I.I.I.I.I.I.J.G.' +. .W W ;.+ 2.5.5.5.5.5.V g ",
"        . k d s ! L L ` 1.'.'.+ V '.1.5.2.2.5.2.t.G.J.I.I.I.I.I.I.I.I.I.I.I.I.I.I.I.I.I.I.I.I.I.I.I.I.I.I.I.I.I.I.I.I.I.I.I.I.I.I.I.I.I.I.I.I.I.I.I.I.I.I.I.I.I.I.I.I.I.I.I.I.I.I.I.I.I.I.I.I.I.I.I.I.I.I.I.I.I.I.I.I.I.I.I.I.I.J.G.N + W  .W W W 5.5.5.5.5.5.B.! ",
"        + m b s : q 4.c.a.;.+  .V V 8.5.5.2.5.5.k F.H.I.I.I.I.I.I.I.I.I.I.I.I.I.I.I.I.I.I.I.I.I.I.I.I.I.I.I.I.I.I.I.I.I.I.I.I.I.I.I.I.I.I.I.I.I.I.I.I.I.I.I.I.I.I.I.I.I.I.I.I.I.I.I.I.I.I.I.I.I.I.I.I.I.I.I.I.I.I.I.I.I.I.I.I.I.J.G.{.W  . .. + W g.5.5.5.5.5.8 < ",
"        . 8 b p i p , _.-.>.'.'.<.'.h.5.5.5.2.5.m y.I.I.I.I.I.I.I.I.I.I.I.I.I.I.I.I.I.I.I.I.I.I.I.I.I.I.I.I.I.I.I.I.I.I.I.I.I.I.I.I.I.I.I.I.I.I.I.I.I.I.I.I.I.I.I.I.I.I.I.I.I.I.I.I.I.I.I.I.I.I.I.I.I.I.I.I.I.I.I.I.I.I.I.I.I.I.J.G.} ). .W W + ..5.5.5.5.5.2.[ N ",
"        . H ] ~ h i N b.z >.'.'.;.;.^.5.5.2.5.5.H E.H.I.I.I.I.I.I.I.I.I.I.I.I.I.I.I.I.I.I.I.I.I.I.I.I.I.I.I.I.I.I.I.I.I.I.I.I.I.I.I.I.I.I.I.I.I.I.I.I.I.I.I.I.I.I.I.I.I.I.I.I.I.I.I.I.I.I.I.I.I.I.I.I.I.I.I.I.I.I.I.I.I.I.I.I.I.I.< } .. .W W W l.5.5.5.5.5.2.0 N ",
"        . =.d s u j ` D z |.'.'.;.'...g.2.5.5.5.B.{ H.I.I.I.I.I.I.I.I.I.I.I.I.I.I.I.I.I.I.I.I.I.I.I.I.I.I.I.I.I.I.I.I.I.I.I.I.I.I.I.I.I.I.I.I.I.I.I.I.I.I.I.I.I.I.I.I.I.I.I.I.I.I.I.I.I.I.I.I.I.I.I.I.I.I.I.I.I.I.I.I.I.I.I.I.I.I.< * ..W . W + 8.5.5.5.5.5./.5 * ",
"        . 2 { g L L ,.D C /.'.;.;.V 7.5.2.2.2.5.;.g H.I.I.I.I.I.I.I.I.I.I.I.I.I.I.I.I.I.I.I.I.I.I.I.I.I.I.I.I.I.I.I.I.I.I.I.I.I.I.I.I.I.I.I.I.I.I.I.I.I.I.I.I.I.I.I.I.I.I.I.I.I.I.I.I.I.I.I.I.I.I.I.I.I.I.I.I.I.I.I.I.I.I.I.I.I.H.L.|  .M.W W + 8.5.5.5.5.5.(.( & ",
"        + l b ~ 0 j t c.{.^.V '.'.V  .2.5.2.5.2./.i H.I.I.I.I.I.I.I.I.I.I.I.I.I.I.I.I.I.I.I.I.I.I.I.I.I.I.I.I.I.I.I.I.I.I.I.I.I.I.I.I.I.I.I.I.I.I.I.I.I.I.I.I.I.I.I.I.I.I.I.I.I.I.I.I.I.I.I.I.I.I.I.I.I.I.I.I.I.I.I.I.I.I.I.I.I.G.Z k. . . .W W g.5.5.5.5.5.I ] $ ",
"        - U g ~ j j ' 4.N |.;.'.<.;.'.1.5.2.5.5.2.' F.J.I.I.I.I.I.I.I.I.I.I.I.I.I.I.I.I.I.I.I.I.I.I.I.I.I.I.I.I.I.I.I.I.I.I.I.I.I.I.I.I.I.I.I.I.I.I.I.I.I.I.I.I.I.I.I.I.I.I.I.I.I.I.I.I.I.I.I.I.I.I.I.I.I.I.I.I.I.I.I.I.I.I.I.J.G.<  .W  .W + ..5.5.5.5.5.5.F ~ k.",
"          V i s h j r 4.b.- >.V '.V + 1.5.5.5.5.5.=./ H.J.I.I.I.I.I.I.I.I.I.I.I.I.I.I.I.I.I.I.I.I.I.I.I.I.I.I.I.I.I.I.I.I.I.I.I.I.I.I.I.I.I.I.I.I.I.I.I.I.I.I.I.I.I.I.I.I.I.I.I.I.I.I.I.I.I.I.I.I.I.I.I.I.I.I.I.I.I.I.I.I.I.I.H.x } W + W W + ..5.5.5.5.5.5.%.~ = ",
"          + r { 5 h ~ L D z :.V '.V V ^.5.5.5.5.5.2.t./ H.J.J.I.I.I.I.I.I.I.I.I.I.I.I.I.I.I.I.I.I.I.I.I.I.I.I.I.I.I.I.I.I.I.I.I.I.I.I.I.I.I.I.I.I.I.I.I.I.I.I.I.I.I.I.I.I.I.I.I.I.I.I.I.I.I.I.I.I.I.I.I.I.I.I.I.I.I.I.I.I.J.H.F.Z S + W W + @ 8.5.5.5.5.5./.b N ; ",
"          + 3.b g j j c.D * :.V V '.V ;.2.5.5.5.5.5. .q _ F.H.H.H.H.H.H.H.H.H.H.H.H.H.H.H.H.H.J.J.H.J.J.J.J.H.J.J.J.J.J.J.J.J.J.J.J.J.J.J.J.J.J.J.J.J.J.J.J.J.J.J.J.J.H.J.J.H.H.J.H.H.H.H.H.H.H.H.H.H.H.H.H.H.H.H.H.H.H.G.G.E.f 2 $ 6.+ W # @ g.5.5.5.5.g.(.] 3 l ",
"          + 3.] i j j ' r D.).U '.'.+ '.h.5.5.5.5.5.2.>.,.B a ^ E 4 E 4 E 4 4 4 E 4 E 4 4 4 4 4 4 4 4 4 4 4 4 4 4 4 4 4 4 E 4 4 E 4 E 4 E 4 x 4 4 4 4 4 E 4 4 4 4 4 4 4 4 4 4 / 4 4 4 4 4 4 4 / / / / / _ / / / 4 _ / / 4 f 3.&.* | $ @ 1 ; p.5.5.5.5.5.5.8 4 = $ ",
"          + v f : #.t 4.r N a.;.X U V '.'.1.5.5.5.2.>.U =.&.' y ! ! ' u 0 f ) ) f f f E f f x x ] ] ^ ^ ( x ^ ^ ( x ] / _ a / _ ^ / / _ 4 a _ B / _ _ _ 4 _ / _ _ _ ^ ^ / ^ ^ ^ / 4 ^ { ^ { f f f f f x f g g s ! #.u ! ` 3 &.` > | | 6 % j.g.5.5.5.5.5.5.k ^ * | ",
"          . k ~ t L u ' ,.c.- ;.X U +.V U V 1.5.5./.U 2 $.&.> &.&.> > &.&.&.&.&.` ` ` y ` ` ` ` ` ` ` &., ` ` y [ y ` ` y y ` y y y ` y y ` ` y y ` y < y y < y y y < y ,.` ` ` ` ` ` ` ` ` ` ` ` ` , &.` ` &.> &.> 3 > &.` < < ` > = * - 5.5.5.5.5.5.5.2.p t & + ",
"          . 9 c p p q %.L _.z :.V '.+ V U V ;./.2./.0.8 &.` ` ` ` ` ` ` ` ` ` y ` y y y y y y y y < y ` y y y y y y y ,.< y y y y < < y < y y < < y y < < ,.< < y y y < y < < ` y ` y y y ` ` [ y [ ` ` y y ` ` y ` ` ` ` ` < < < ` C x.5.5.5.5.5.5.5.2.;.] #.8 Q ",
"          + m ^ h t #.#.4.~ } >.<.+.U V V + 1 '.;.].;.=.> ` &.` ` ` ` < y y ` N y y y < < y < < < y < < ! < < < y < < < < < ' ! < < y < < ! < ! < < < ! < ' < < < ! ! ! ' ! < < < < < y y < y < < y y < y ,.y < y , ` ` &.&.` &.C 6.g.5.5.5.5.5.5.5.5.5.H 4 ,.3 = ",
"          + H ] ~ 4.#.0 ' ! N ;.'.V V '.U '.+ '.V + ;.;.1 ; 2 & $.$.= $.C $.$.> > &.&.&.> &.&.&.&.` ` [ k ` ` ` y y ` ` ` y [ [ y y [ y y y ,.y y y ,.y ` [ [ ` [ [ y [ k ` ` &.&.&.3 3 > $.$.8 $.= = 2 ; ; ; ; 6 @ + + W W ..8.g.5.5.5.5.5.5.5.5.5.5.2.k ^ , m = ",
"          - *.{ h n h p ' 4._.-.;.'.U X V +.V V V U V <.'.'.V V U 1 V V 1 U U 6 U 9.9.6 9.Q U 7 U 0.9.Y R l B.; *.=.; *.l l l Y Y ; 9.R U U 9.9.9.7 U U U V U V ;.V ;.W ;.;.>. ...!.e.8.e.8.2.e.2.2.2.2.2.g.2.5.g.2.5.5.5.5.5.5.5.5.5.5.5.5.5.5.5.5.5.e.r h 9 $.}.",
"          + *.f ~ g h h Z [ c z <.+.+ U U U U U U U T U U U U 6 7 U U +.V +.T U U U +.+.U U '.V V + ;.;.<.'.'.'.;.;.;.<.;.;.;.;.;.;.;.>.].:.].].:.].].^.^.2./.2.2.2.2.1.2.2.g.5.2.5.5.5.5.5.2.5.5.5.5.5.5.5.5.5.5.5.5.5.5.5.5.5.5.5.5.5.5.5.5.5.5.5.5.1 { [ 9 8 = ",
"          - l { h h ~ j L [ ~ D.>.U U V V +.U U U l U l Y 7 U U l U U 7 7 T T U U +.U U U U U V U V 1 U U U V <.'.V '.'.V 1 '.'.'.;.;.;.>.;.;.;.>.:.].].^.]././.^.^./.1./.1.1.2.2.2.2.2.2.2.5.5.5.2.5.5.5.5.5.5.5.5.5.5.5.5.5.5.5.5.5.5.5.5.5.5.5.5.5.H 4 ` ` = =.",
"          . U 5 ~ h t : j 4.t 4.:.U U V U U R U T U 0.T T 7 U U l U 6 7 1 U U +.U T T U U T U U U U 6 U U U U U V U V V '.V '.V '.;.;.;.;.;.;.>.:.].:.:.:.].:.].].^./././././.1.2.1.1./.2.2.2.2.2.5.5.2.5.2.5.5.5.5.5.5.5.5.5.5.5.5.5.5.5.5.5.5.5.5.2.K x [ @.& 8 ",
"          - 1 b d i p : q h ` ~ -.U +.V 0.T T T U U +.R U U T U ; U U T T U T U T 0.R R T U 0.R U V T +.V U U U +.+ V X V V '.'.'.;.<.;.;.;.>.>.:.>.>.>.:.:.].^.^.].^.^.1.1././.1.2.2./.2.2.2.2.2.5.5.5.2.5.2.5.5.5.5.5.5.5.5.5.5.5.5.5.5.5.5.5.5.5.~.M < , 9 % 7 ",
"            + M { g h ) j e [ c & ;.+.V U T +.U U 6 U U R T R U 6 U 0.l R T T R l R l 7 0.V R R U 0.T U 0.7 1 V U V V <.'.V '.;.'.;.;.;.;.;.:.:.>.>.:.:.>.:.:.].].].]./.^.1.^./.1./.2.1.2.2.2.2.2.5.5.5.5.5.5.5.5.5.5.5.5.5.5.5.5.5.5.5.5.5.5.5.5.2.*._ 4., 9 } ; ",
"            + q b i y.d i r ! d ` ;.U U U U U U U U U U U l R R 7 U U U 7 R R l 7 Q Q 7 U T R R T m.U U U 9.U U U V '.V ;.;.;.<.;.<.'.;.+ V ;.'.V ;.>.].:.:.].:.].].:.].].].^.^./.2.2.1.1.2.2.5.2.2.5.2.5.2.5.5.5.5.5.5.5.5.5.5.5.5.5.5.5.5.5.5.5.5.k ~ 9 @.@.8 2 ",
"            + q ] ~ %.0 i r t L ~ ;.T R R Q *.R R 9.0.0.T U 0.l ; R T *.Q R 7 7 T 0.l T R R U T m.R T R U U '.V <.9.0.O }.m 9 ,.3.' u g ) ~ ) ) s ' %.[ 9 9 = Q V <.>.^.]././.^./.1./.1.1.2.1.2.2.2.2.5.2.2.5.5.5.5.5.5.5.5.5.5.2.2.2.e.8.8.e.1.2./.A _., , m }.}.",
"            . K { h u p 5 i ~ ,.c & % 2 H $.3 9 &.> 3 9 8 = Q m.Q T R *.; R U R R l Q R T 0.l U R U U U 0.O G 9 ,.j d f { g ~ Z y , &., $.3 $.$., &.y %.! ~ ] f 5 p 4.3 H V >.]./././././.1.1.2.2.2.2.2.5.5.5.5.5.5.2.2.~.W 6 =.= = = H }.2 % Y  .O B ' , 9 m % }.",
"            + k { A g p i : ! ' d ` V m.T T l % = $.> &.[ ` [ k 3 8 =.l Q Q l % *.l l Q m.Q l U V w.m K r d f ~ y > 2 R 0.0.V V w.w.w.O O O J O m.0.<.<.<.;.<.U ; } ` Z { { : k H V ^.2././././.2.2.2.2.2.5.5.2.>.9.G m &.9 3 8 | $ - ..l.2.2.8.2.F a ,.[ &.3 2 9 ",
"            6.9 ] h s n e h ~ : c.b.V w.I G H O V V V V R & = 8 > ` k , 3 % *.Q Q *.*.l U V O 9 %.5 f < @.= *.V 0.I m F L A [.( _ B v.v.v.n.v.n.B B _ ( ( A ,.F m m.V W + $ C y g { %.m 0.].1./././.1.2.5./.m.9 k k C $ . ..2.g.g.2.].V P 2 R ]./.[.x ,., k 9 P 9 ",
"            + 9 ] d %.r i h 0 %.[ 4 4.A v.n.n.B ( r m P V 0.U V R % $.&.[ k 9 = Q m.R l G K A p 3.3 Q Q O m K d._ v.o.C.q.C.q.N.z.z.q.q.N.q.z.q.q.q.z.N.O.q.q.C.C.o.B b 4.3 Q ).W = ,.5 b r 8 ;./.2./.;.G K k = - !.2.g.2.g.2.;.G L ( B n.o.v.D %.B L v , 9 9 2 @.",
"            + 9 ( g u p A i g h @.5 C.O.q.O.O.q.q.O.o.a ' $.Q U *.2 R l =.}.9 ` [ [ L g i [ 8 *.R V 9 _ B o.C.O.r.C.r.r.r.C.O.q.C.q.P.q.N.q.r.C.C.r.r.C.C.O.N.q.N.q.z.z.O.s.v.4 {.l.2.;.*.9 q ' , 3 v 3.k U e.2.2.2.2.5./.O L _ o.q.q.r.n.( n.q.q._ 4.y , , 9 = 9 ",
"            + = ( 5 g g i d t h ,.A q.C.o.s.C.C.C.C.q.C.C.v.~ $.T 0.Q Q ; R Q 2 9 3.,.9 *.V <.0.X K A.q.O.C.r.r.r.P.C.r.r.Q.r.q.r.q.r.r.C.s.s.s.C.o.o.o.n.v.n.n.n.o.o.n.C.P.z.z.u.L.f.2././.>.O k v m ;.2.2.1.1.2.2./.=.j n.N.q.q.C.A.] ,  .G o.Q._ t ,.,.[ &.m ,.",
"            - 2 M { ~ p i h : g ,.( Q.v.A.C.C.r.O.C.C.O.r.P.N.A.L.$.m.Q 2 Q *.l 0.0.0.U T R R V G o.C.C.s.C.r.C.Q.P.C.P.q.r.r.Q.q.C.C.C.C.C.o.o.u.u.A.A.v.v.B B B _ / ] ] x g _ q.s.{./.].].].].]././.1./.1./.2./.J 5 o.z.q.r.o.v.^ Z > % ).].[.z.4 N v [ , m 8 ,.",
"            . 2 d { i ) g e g e 9 _ o.B A.r.P.q.q.C.C.o.s.C.q.z.N.v.N % l Q % l T T l % R 0.T ).q q.A.o.r.C.C.O.Q.q.r.q.r.C.q.C.P.C.r.C.C.C.o.s.u.o.o.o.u.n.n.v.v.B _ ^ d ! & V _ z.4 1 /.].].:.>.].^.].].1.2.<.K n.z.z.r.o.v.4 ~ Z ` 3 }.; 0.A z.v.' ,.` , 9 = 9 ",
"            . U 5 b d : j g f i 3 ( O.v.o.Q.q.C.C.C.C.s.o.A.v.u.P.z.C.4 3 R Q % Q m.Q T R R +.~._ A.A.s.C.C.C.s.s.C.Q.Q.Q.C.Q.C.C.C.r.Q.C.C.C.q.C.C.o.o.o.u.A.A.v.A.v.v.B B ] k.K z.a 7 1.].].>.>.].^./.1./.G _ q.z.r.C.A.B 4 f Z < y @.3 8 9 _ z.v.t v 4.[ 3 8 K ",
"            - 1 5 f ) t L q ) ) 9 5 Q.A.o.s.C.Q.C.C.N.N.q.C.A.B _ A.z.z.n.3.2 *.Q *.% Q R Q # /._ A.A.o.C.C.s.C.C.Q.C.r.P.Q.N.z.N.N.N.N.N.N.N.N.N.N.N.Q.Q.P.C.o.A.o.A.A.v.v.A.t 5 z.a @ 2.:.].]./.^././.<.K o.q.P.r.A.v.a 4 x ) s < < ` k ` 5 C.z.a %.k [ &.8 9 ' ",
"              1 q b f p t i c 5 [ , s.o.o.C.Q.r.P.q.z.P.Q.O.N.C.A.c { o.z.q.c }.*.P Q % 0.Q +.e.[.n._ B o.C.O.q.q.Q.N.P.q.n.( _ ( [.[.A A A A A q A A [.A A _ o.o.A.u.u.n.v.v._ n.z.4 +./.>.:.].]./.2.O ( q.r.C.r.n.v.a _ ^ x f h u ! < 4.) v.z.C.] %.,., 3 = 9 q ",
"              7 L b d t t g t i ' = ( O.n.C.C.O.q.N.P.C.q.z.z.q.z.u.c : _ z.z.4 8 m.Q l R Q % 8.$.v./ v.s.r.q.O.r.r.N.q.z.d.I I I I I I I I I I I I I I I I K o.C.o.u.o.o.A.A.o.C.N.` ;.^.:.].>.]./.G v.q.r.C.o.u.v._ _ 4 ^ ] { [ #.f g f _ o.q.A.s v ,., 9 m m g ",
"              1 k b h h h ,.[ r e @.3.N.o.s.o.Q.q.Q.O.Q.N.B &.}.K C.z._ , [.r.z.a } l % m.R O + /.q v.A.o.C.Q.r.Q.Q.N.Q.N.n._ _ _ ( ( M [.[.[.( ( ( _ _ B B B o.Q.O.s.C.s.s.s.C.z._ % >.>.].>.:./.m o.z.r.C.Q.n.A.B B / 4 ^ x } J M / / ( A.N.z._ 0 #.c.k 9 @.9 g ",
"              + 9 ] { h q h p p b t k v.C.o.s.Q.O.C.P.z.4 + >.6 2 o.z.z.a , 3.C.z.a } *.Q m.l 2 !.; v.s.C.C.C.C.s.C.q.O.q.z.N.N.z.z.z.z.N.N.z.q.z.z.z.z.z.z.N.Q.C.Q.C.C.q.r.Q.z.v.8 ;.].>.:.:.].9 C.z.r.P.C.o.n.v.B _ _ _ ! 7 /.K B _ _ B s.z.s.] h r 4.[ 3 P k { ",
"              + 9 ( f p h g 5 i i g @.r s.o.s.s.Q.C.C.u.D.<._ o.A.r.P.q.z.A.` , o.z.4 P Q % Q l T g.= A.C.r.o.s.s.r.C.q.P.P.r.q.O.q.r.C.C.Q.r.N.r.q.q.s.C.q.r.Q.q.P.r.N.q.q.z.A.` ;.:.>.:.].].9 o.q.C.N.C.o.n.A.v._ B 4 > ..2.I _ _ _ B o.z.z._ ' ~ v v , & % k { ",
"              . H ( g ) h 5 { 5 i b c.m B s.o.C.r.N.N.u.z H C.z.q.P.C.r.P.z.C.N > A.N.N l Q *.R P T g.* a O.s.o.C.r.s.C.P.N.N.r.q.r.s.s.C.C.C.C.C.C.s.q.r.N.P.q.q.q.P.r.z.z.A.` U >.:.>.]./.9 o.r.r.q.r.o.o.u.v.v.B v.: ).5.<.[.B B B n.r.N.s.c [ 4., m k m 8 v 5 ",
"              - =.( { 5 i { h g i ) c 9 n Q.o.C.Q.P.P.C.z J q.z.z.z.r.C.r.q.z.O.` h z.x R O l Q l Q R 1.6.E C.N.C.s.r.C.C.r.r.r.q.Q.C.C.C.C.C.r.r.C.C.q.q.q.Q.r.P.r.q.q.z.v.$.+ >.;.;.:.2.G o.C.C.q.q.o.o.n.A.v.v.v.a v.~  .F v.B B A.r.N.q._ ' ,.! t ,.` m m K ] ",
"              - 2 ( c b.j 5 ~ Z r i { : 9 B Q.s.Q.r.N.N.{.2.0 v._ r.z.C.q.P.q.z.n._ N.4 T Q l R Q U Q Q a.e.&.v.z.q.o.s.C.r.C.C.P.r.q.r.r.q.N.r.q.q.r.r.q.q.C.r.C.C.z.o.g = ;.;.;.;.>./.I n.q.o.C.q.C.o.o.o.A.n.v.v.B v.v.h ( B v.v.o.q.z.o.p k %.#.h ' , 8 m ,.d ",
"              + O e ] i %.: f i j 5 { [.@.K s.o.C.C.C.N.A.* ~.(.I C.z.q.Q.z.z.q.Q.s.z.s U 2 Q Q R Q *.O Q  .2.1 t.o.q.C.r.C.C.C.C.r.q.C.r.C.r.P.C.C.C.C.O.C.s.q.N.C._ 9 U ;.;.>.<.>./.<._ q.C.C.P.q.C.o.o.n.A.u.n.v.v.v.B v.A.v.n.o.q.q.z._ #.,.n ' L [ @.3 9 %.h ",
"                Y h ] h j 5 M { 5 5 { g D 8 ( r.A.o.s.C.N.u.x : / C.Q.N.q.q.N.Q.C.N.C.} 0.P 2 P m.Q l m.O O Q  .1.V F _ r.z.q.r.P.q.O.r.C.C.q.q.C.C.q.r.q.q.Q.A.b 9 R ;.<.<.;.<.<.:.>.q z.C.r.q.r.s.C.s.C.n.o.A.n.n.n.v.v.v.A.v.o.z.z.z.v.c.h h 0 L r [ , m 9 p u ",
"                1 %.^ h r i d A i g b 5 i } m C.C.s.C.s.C.q.z.z.z.q.r.P.N.q.r.Q.q.z.Z R 2 2 % Q Q R R P P O 2 2 l W /.~.=.#./ A.o.C.q.N.z.N.q.z.P.r.C.A.v.] 3.H V <.;.<.;.;.;.;.;./.9 C.C.C.z.N.C.o.s.s.o.o.o.u.A.n.A.n.A.n.A.o.C.z.z.O.4 %.%.' j %.' 4.k m 9 q < ",
"                1 3.^ q n j f e d M f d j #.9 A z.s.s.s.r.q.q.N.N.N.N.r.P.P.C.z.N.~ 0.*.2 O % *.Q R Q Q Q 2 P Q O 2 Q R ;.].>.W *.$.[ ' : ~ ) s ! [ 3 = T V <.'.'.'.<.<.;.;.<.'./.w.B C.o.z.r.r.s.s.o.o.o.o.o.o.o.A.A.A.A.n.n.C.z.q.z.B ~ p 4.k r ,.4.4.k 9 F 5 4.",
"                + v ] 5 g t 5 d { ] d e f g p 3 _ z.o.C.N.q.P.N.Q.q.P.r.C.z.z.A.y 0.m.2 O P =.O O Q =.; R Q Q Q Q O O 2 2 O m.R V ;.>.>.>.>.).<.>.>.>.<.V V V V V V V <.;.<.<.>.].q q.o.r.z.r.C.C.C.C.o.n.o.o.o.o.o.n.A.n.C.C.N.z.z.A.i n c.! r L ,.%.,., m 9 g ` ",
"                + k 5 { d 5 { 5 h { ] d j h ] 4.9 v.z.C.N.P.z.N.C.r.z.z.z.A.s = V O 2 2 P Q *.O P O 2 Q Q *.m.O P O Q R m.Q Q m.O m.T l m.w.0.R 0.V V <.<.V V V <.V V ;.;.'.>.1.G o.C.C.P.N.C.C.s.C.N.C.o.o.o.o.o.n.o.o.o.C.z.P.z.s.f %.' 3.L %.' r L ,.3 8 k { > ",
"                + 9 ] g { g i M { f { d h #.q D v 9 _ z.z.N.N.z.z.N.o./ 3.2 R O 2 2 2 = }.=.O % Q O l Q Q 2 Q Q % Q Q R Q Q Q 0.T 0.U U l 0.0.+.U <.V V <.V U U ;.V V ;.;.<.^.>.[.z.C.r.C.C.r.o.s.v./ o.s.o.o.s.o.o.o.o.C.q.N.N.r.4 t %.j t r n %.! 4.k , % k 5 * ",
"                - H ^ { M h ) { 5 j f d g b { g { ,.9 _ n.q.z._ 0 k H m.w.O 2 2 }.2 % 2 2 2 % O =.2 l l O % Q Q =.=.Q Q *.P R T l R 0.T R R U U V 0.U U U V V V X V '.<.;.;.].m C.C.C.o.s.C.C.C.N.' V _ O.C.C.o.s.s.o.s.q.q.N.q.B h j i 3.j #.%.0 ,.L ' , }.K f | ",
"                + 2 b { ~ : g 5 { g M 5 5 ~ 5 d h f j j y.v.z.` <.R l 2 2 2 P % O O % 2 2 }.2 2 2 O 2 2 2 2 % O P 2 m.O Q m.T w.l Q R U U 0.T U V V V V U U V U X X V ;.;.>.>.[.r.o.O.s.s.C.C.Q.v.@ 2.(.( r.o.C.r.s.C.r.q.z.z.B 5 g p r F ' h r 3.[ L v @.= F { z ",
"                . =.b f d : i 5 5 g g b M ~ : 5 b f g d ~ h n.A.{.2 2 2 2 P 2 2 2 2 = 2 }.2 2 H 2 P 2 }.}.2 2 % 2 2 Q Q Q Q Q O R Q R Q R R R R 0.X V 0.U V V V X V V '.<.>.I C.s.s.s.s.Q.O.C.q.{.5./.m B r.o.o.O.r.z.z.z.z.A.] ) 5 i #.' ' 3.3.r %.%.L , @.3.{ z ",
"                + *.5 g { ! h 5 b { i i ~ ) d h { g 5 ] ] t i o.u.N *.2 2 O = = 2 2 2 }.O 2 2 2 I 2 2 P O 2 2 Q O 2 Q Q % Q Q Q Q R R R R R 0.l T 0.T U V V U V '.U V V '.>.q q.A.r.N.C.C.O.z.x h.w.A C.q.o.s.q.q.N.z.z.z.v.c h %.p g t ' t ,.9 4.#.' [ @.m 3.: $ ",
"                - O { ] 5 i x { b M { 5 i g d h { f f 5 ] f ! d o.s.N 2 2 2 2 2 }.2 2 2 2 O 2 2 }.}.2 2 2 2 2 2 % 2 P Q Q Q Q Q Q P Q R Q 0.R l T 0.U U V V U R V U V V ;.w._ Q.o.C.C.C.r.P.C.3 9 B z.r.C.C.q.z.z.z.z.z.A.b u i D : ' %.p %.n k , ' L 9 8 9 r ! @ ",
"                . ; 5 { { { { d M b h i 5 { d 5 M g g { ] b d f ] n.C.b.= P % }.= % 2 = 2 = }.2 H 8 2 2 2 2 2 O P 2 }.O =.*.Q % % m.Q % O Q R R R 0.U U V U U 0.V V V ;.>.G o.o.o.C.C.o.C.O.u._ C.q.r.r.q.q.N.N.N.z.N.A.b %.0 j h g j r ' ' 4.L 3.[ ,.,.9 @.3.u # ",
"                . l { c h p { { A 5 b d b f { b 5 { f M { f { d d i v.q.x } O }.= }.8 2 2 }.}.H }.}.2 2 O }.2 }.}.}.2 O O 2 Q O Q Q O P R 0.R R U U R R 0.V V V V V V V >.K r.o.r.C.C.q.C.r.C.q.O.C.q.q.N.q.z.N.z.q.n.{ h n : t i < ,.4.' L 3.L [ k 9 ,.m } 3.: w ",
"                - ; { ] f p ~ { f e 5 d { { { { ~ g g d { d d f E i A B z.a ` 2 2 H = 2 = H = = 2 }.= H }.$.8 2 2 }.2 O % 2 Q O % 2 P *.Q m.Q l R V 9.0.U 0.R U V U R U >.( C.o.r.C.C.r.q.q.r.r.C.q.N.N.P.P.z.z.z._ p j e e p h t y 3.%.4.n t [ K [ , [ 3 3 r ' @ ",
"                + *.{ ^ g : g { { 5 { p h M f i 5 g c d { f e h i { M ' ( q.s.L.= 2 = 2 }.= H H }.H = H H 8 = 2 }.}.2 }.& 2 % % % 2 P R Q Q Q R U 0.T R T U 7 T V 0.U <.<._ C.C.q.r.r.s.N.N.q.r.r.q.q.z.z.z.z.z.B ' L j j n j t j ~ h %.t #.' , ,.,.,.[ @.m 3.) w ",
"                - ; g d ~ : 0 i d d 5 5 h d b { f ) ( ] ] b d d A e { c r M o.N.4 @.% = }.}.8 8 = 2 }.}.}.= 2 2 2 = 2 }.= 2 O Q 2 P Q O % m.R R T 0.R l U 0.7 U V U U ;.w.v.C.C.q.q.q.C.r.q.O.r.r.N.z.z.z.z.n._ d t i Z 3.q { e h s ` [ v ' %.%.< ,.%.v 8 $.%.: w ",
"                  l { { h g f 5 5 b E b 5 ) 5 d h ] b b b b ( ] f d e f b f h _ C.u.t m }.H 2 2 = I }.2 }.= }.}.}.}.}.}.2 Q O O O O O 2 O Q R R Q Q T R T 0.l R m.R 0.'.I o.o.C.r.q.N.r.q.q.q.q.z.z.z.z.z.u.d ' 5 h ' ! n r h d j ,., ,.%.#.3.,.' 4.v 9 = m r ! @ ",
"                  l d { d g { 5 i { b d { s t M b b { ] ] 5 5 { b M e d 5 5 ~ : d B q.v.L m = =.}.= = 2 I = = }.2 2 2 2 2 2 Q Q 2 2 O =.P Q R Q O O R Q Q R Q Q T T 0.;.I o.o.C.q.q.N.q.P.z.N.N.z.z.z.s._ d %.%.A t ' h : L j ` ' : %.3.L t ' ,.L v 9 9 8 m r #.w ",
"                  l f { i A ~ #.[.5 g i d d r 5 ] f { { { 5 5 h b b b 5 d g b ] ~ t ( o.C.v.h m }.= 2 }.H = = 8 = }.2 }.}.}.O 2 }.2 2 2 P P Q Q m.P *.Q R Q l U Q R R V w.n.r.r.q.N.z.q.z.q.q.N.z.r.v.E 4.L h p i h ,.#.r h f y %.~ ,.r ,.' 3.3.,.9 v , 8 m %.u w ",
"                  l { { { d t h ] M A { f f d d { g d { d h h d p M d h ] ] ^ f d 5 f [.( o.z.A.c , = 2 2 2 = }.}.H }.}.8 }.O 2 2 P 2 2 O O 2 =.Q O Q Q R O Q R m.R 9.0.].q z.q.q.q.q.N.z.q.z.z.o.M j %.h t i h n h g g h e t 3.3.&.,.,.k ,.4.3.[ ,.3.9 = 9 3.! @ ",
"                  l b ] h h ~ 5 M { t q g ] { h h ~ b M { c h h s h M ] c b M ) d ( c d 5 i _ C.q.u.x < @.2 2 Q I = }.2 2 2 }.P 2 O I }.2 P 2 % Q O P P Q m.l P R T V V 2.=.r.q.P.Q.q.q.z.z.o.B ] r j h e h t t [ 3.q i j r r L ,.[ ' @.3.k 9 L ' 4.,.3 = m ' ! @ ",
"                  l { { : D s n h i p s f ] b { g d d 5 b M 5 b { { { { d d 5 g e d f f M g f A [.v.C.Q.v.x < 9 8 2 2 O 2 2 O O 2 2 O }.}.2 O O 2 Q Q *.Q R T U w.m.I 9 3._ r.r.q.N.O.q.A._ c h e p h 5 i : d h , K h n r u %.n h ~ ' v j [ K L L [ 9 9 = 8 r Z # ",
"                  6 { ] 5 f f e A ~ { b.t x g q p i g 5 5 5 h 5 ] { h ] ^ { e g f t ~ j g M h h j L q B C.q.O.n._ f %., 9 H }.2 }.P O =.2 O O O O O O 2 I H m F r ( v.C.q.q.v.5 h 4 _ ] f : %.) ~ L %.: ! %.h ! %.n %.%.v q n 0 ' 3.t r ,.@.,.L %.' k 9 2 m n ! w ",
"                  l M ] d ! : h { e : d b d i t j f f h h h g ] ] { b b ] c f E f p 5 b { { ~ b i : r A M M _ n.C.q.O.C.n.B ( M i L K ,.F K F K 3.n [.b _ B o.q.z.N.o.v._ g %.%.K [ 4.t h : j 5 ! h j r : 4.r ' t d t h q h ,.t t 4.4.3.L ' 4.,.%.,., 9 % 8 %.! # ",
"                  6 { ] M g p q d g 5 d ~ { d n h f b ~ d { M { { ] M p { d e f r A g { 5 M i { e M b h 5 d p t t { _ n.o.o.C.z.q.q.q.q.C.C.C.q.q.q.q.z.q.o.n.B _ 5 i q 4.%.n e M h n n p i q r ! r j b d L n ! ! r 4.h j %.' 4.%.3.4.,.%.%.! [ ,.3.v @.= m L t @ ",
"                  7 5 { { i h e d { b h ' i d g { c b g { ] ] g 5 5 { c t q d d e M ~ t D ~ p 5 h b g h 5 { c.n h y.j 5 ^ b [.( _ _ _ B v.B _ B _ [._ ( A q %.r 3.,.i ~ 4.i h h j i ' L 5 i r Z t ' %.t h r %., ' ' %.t [ [ s h D ~ e 4.y < L ' @.v k 3 % H q : w ",
"                  6 f { h : ~ 5 i { { 5 i s ( 4 ( 4 e _ _ _ _ 4 / b b x ) e b 5 q q b b { g b.) p b g 5 { d d h b d g d h p 0 g 5 h p q 5 : %.q ' 4.p Z L r ' h i ~ g i d g L 5 Z p %.3.p p j ! #.%.L #.~ e b f b ( ] ^ e h b ( M ( _ 4 b.! 3.' [ k k > 2 m %.! w ",
"                  U g x h : #.p h s : n A / b g b M h ( _ ^ b ( ] _ _ 4 4 _ _ ( ] ] ] { M ] o p 5 i h i b { { e 5 i h 5 f ! h { f 5 i 5 g D h d j n Z d D r 5 f j h y.p 5 f p e ' d { t c.h h 4.j c { { 4 ( ( b A b { M M q 5 ] d ( ( _ B ^ ' [ < 3.@.8 = 9 3.! @ ",
"                  1 p g p g p q d ~ e n d d ] B v.A.o.o.u.o.o.A.v.v.B 4 4 ( _ _ _ _ _ / b d { f j d d d ~ ) g 5 5 ) h i i ) j A b g b ( { b c c 5 b f d : t p Z ' d e r ~ 5 q n g i h D g b M b ( ( ] j 5 M B _ a n.u.u.o.o.s.C.r.r.q.n._ v.c 9 v ,.@.= }.9 k ,.w ",
"                  1 p g i i p p e i f h ! ] o.P.C.q.z.q.N.z.z.q.z.N.O.C.C.o.A.B B _ _ ( b ( _ ( f { ( b h ~ d h d { ( ( b { b ( _ ] _ _ _ ( _ ( b ( _ { b c g c M ( ] e d { d e ] ] ( c d b b M _ _ v.n.C.q.z.z.z.z.z.z.z.z.z.z.N.C.v.o.s._ B h k k k ` & }.K ! w ",
"                  1 p ~ h ) t %.g g : n q n.C.u.s.s.C.r.z.z.C.C.C.C.C.C.N.N.z.P.N.C.u.v.B 4 ^ ] ] ] ( _ _ 4 _ ( ( ] 4 _ { { ] ( ^ _ _ / / 4 _ 4 ^ ( ] ( ( _ { ( ] ] / _ _ _ _ _ 4 ^ e %.< b v.n.q.q.q.z.z.z.z.z.N.r.C.P.C.o.o.A.B x C m n.A._ ] ,.4.@.3 & }.L ' @ ",
"                  1 i f h d g : h h ~ ,.M s.v.A.o.s.C.A.5 _ r.C.s.s.o.s.o.s.s.s.o.o.r.q.q.s.4 h h q d { f f f D g ] 4 a a v.u.u.u.r.o.s.s.s.z.C.q.o.A.o.v.v.a _ ] ] ^ d e g b h 4.) #.q B q.z.N.z.q.q.r.q.q.C.s.o.u.o.n.A.v.v._ 4 x {.+.t.s.B ^ < ,.k } 8 H ,.' @ ",
"                  1 p { d g ~ e h ~ 0 K _ o.v.o.s.s.C.Z 1.m o.s.o.o.o.s.o.A.A.A.n.v.v.a ] v.C.^ j L #.h j g : D B o.o.r.q.q.r.r.N.N.q.r.s.C.r.C.C.C.o.o.r.r.o.q.C.o.v.] : : q ~ ' j L ( z.q.r.P.N.Q.s.o.o.o.o.n.n.n.A.v.v.B a _ _ _ 4 > 9 r.v.4 y , 4.3 2 8 t.< @ ",
"                  1 j x d h f g 5 d y 9 _ A.A.s.o.o.C.x i.H C.o.u.s.o.o.A.A.o.A.A.v.v.v.Z 3 B A.d n j d t j 5 n.Q.r.r.P.P.C.C.C.N.q.s.n.o.n.n.A.v.B a _ B B B _ _ { v.u.: ! i 5 5 p q o.r.P.f G M C.s.o.o.n.o.o.u.A.n.v.v.v.a _ _ _ ^ ! ! o.v.4 ' &.m } % m 3.! @ ",
"                  1 i ] ~ Z p d t : 3.k _ o.A.s.s.C.N.a ..$.C.C.s.o.C.r.s.o.o.n.o.o.u.v.A.{.9 C.] p { d n %._ q.s.r.C.C.u.A.s.4 ` 0 n.o.A.A.v.v.B B _ B _ 4 ^ f t $.2 B _ h A e b #.[.q.C.N._.+ /.A N.s.o.C.C.o.o.A.A.A.o.A.B _ _ _ / ) g s._ ] #.` 3 = 2 m %.< + ",
"                  1 p { e p : h r t ! k b s.o.C.r.N.N.a p.m r.Q.C.C.Q.v.v.r.o.s.a _ o.A.n.^ 3 v.a j d M r q o.o.r.C.r.C.o.u.C._.).2.[ C.u.v.v.B n.v.a _ _ _ _ _ ( f 7 K n.d g 5 g ,._ q.s.s.r.x 5.9 z.o.C._ ^ o.u.n.A.v.< q v.B _ B _ { ] o._ c ' ,., 3 & m 0 < - ",
"                  1 0 h h f ) p ) { ' 9 b C.o.C.C.Q.q.a j.8 q.P.r.s.' 8 2 f z.x 8 m , A.v.v.' _ n.d p { h j o.s.q.Q.C.o.C.s.o.o._ j.B.A.o.v.v.v.x _ v.a a _ _ _ _ _ ,.K u.~ 4.0 Z K v.o.s.C.u.D.~.A z.Q.z.L.9 q.C.C.C._.*.( v.B B B _ { _ o._ d ,.,.v $.| 8 L 4.@ ",
"                  1 ) c h : f i 5 ] ' 9 { P.u.s.C.C.z.a j.m q.q.z.^ G _ _.= 4 } A v.& A u.A.o ] u.{ j d f [ n.N.z.r.q.O.Q.r.C.z.a ..H n.C.o.o.A.* c n.v.B B a _ B a ~ ( B h %.h t r C.s.r.r.u.z /.A z.B ,.= k s.: ,.B D.<.( A.v.B B B { B u._ h ,.,.v 3 2 9 r y - ",
"                  +.p { d ~ g e i { : 9 3.o.o.C.Q.N.z.a p.8 q.z.z._.m C.v.}.4 & ( O.} q C.u.x 5 u.d f e j 3.n.N.q.N.P.q.N.r.q.z.{.2.q z._ ,.{ A.} G t.B / 9 G _ B B ] n.B h q i ' %.r.C.N.q.O.a ~.H q.} 8 | F f H } F N U _ A.v.v.v._ ( u.A._ j v 3.[ 8 & 9 r < + ",
"                  1 p { h g f s h ~ s 9 K n.Q.C.q.r.z.a j.$.q.z.z.A.D.G =.V K k.J m 8 v.o.o.4 5 o.] t e h L B z.N.N.N.N.N.q.Q.A.@ 9.n.z.x C J M } O % 3., 9.` _ v.B ^ n.B 5 5 t ' 5 q.q.z.r.z.v. .I C.& _ Z &.` O 8 9 c.3 o.A.v.v.B _ _ r.n._ 4.[ L v m = m 0 4.- ",
"                  1 i b g j g t u j d [ k _ N.s.P.C.q.C.x _ r.N.N.z.A.o < o s ~ Z g A.Q.u.o.a p C.c #.i t , ( z.q.N.z.N.N.Q.N.x ^.q z.Q.^ v Q ' 8 ( _.% }.[.z.v.B _ ( o._ M { e v M q.C.z.z.4 ; 2.%.z.* %.D.3 N =.p _ < G o.o.v.v.B / B r.v.^ ,.,.[ , 3 8 8 L y - ",
"                  1 ) f 5 j ) h h t f ! m ' C.C.P.Q.q.q.z.z.P.N.N.z.z.z.z.z.z.z.z.z.N.C.r.o.A.{ o.( p ~ : [ 5 z.P.z.N.N.z.N.z.L.5.H ] A.z 9 $ 3.& q ` }.& ,.a B v._ _ C.4 p q A 4.q q.q.z.z.x =.K o.z.f H I 3.a 9 9 _ _.F o.o.A.n.v.v.o.u.B x 4.k , , } 2 m 3.< @ ",
"                  +.j f g ~ j h f f h ' 9 k _ N.C.N.P.r.Q.q.Q.z.z.z.z.z.z.z.N.q.Q.C.C.r.C.o.A.v.C.b j r { 3.4.r.z.z.N.q.N.q.z.c 9.<.9 u.@.G I e , O I ( _.9.8 B v.B v.A.5 h p p j v C.z.z.z.C.C.q.N.z.q.v.n.o.q.n.B o.u.o.C.o.o.C.u.r.o._ a j [ ` [ v = = m 3.< - ",
"                  1 p b h j g i j M h t 3.3.4.B P.N.N.Q.N.P.q.z.z.z.N.z.z.z.q.N.C.o.r.Q.C.C.C.q._ d j j e d ` B z.N.q.N.q.q.N.o.v.v.o.q.n.B v.o.n.B v.o.o._ _ v.v.v.r.B n r %.3.3.k 5 z.z.q.z.N.r.q.z.q.N.z.z.P.q.z.C.C.N.q.N.q.z.N.v.b _ _., ,.,.,., 3 2 H %.< @ ",
"                  1 p { ~ s %.j t i g g g ' [ j _ A.o.N.z.z.z.z.z.z.z.z.z.z.N.N.z.z.z.N.z.z.N._ r h 5 A 5 { < h q.z.N.z.z.N.q.N.N.q.q.C.N.r.O.C.r.q.C.C.o.o.C.o.n.q.s.b h t t [.n L , ( r.z.z.z.z.z.z.z.z.z.z.q.N.z.N.N.N.N.r.o._ { q ( ] ,.k [ [ ,., $.% 9 K 4.@ ",
"                  + #.{ h n t h p g g i i f c.h { E.( ( B o.C.q.q.z.z.z.z.z.z.z.z.z.q.C.v._ ( g %.h M h i n %.L 5 C.z.z.q.q.z.N.Q.C.r.N.q.q.Q.C.r.C.C.C.C.O.N.Q.q.C.( %.L ! r j ' ! h 3.i / _ B o.q.q.q.z.q.q.N.q.C.o.v.B _ ( q q M ] 0 F ,.,.4.` , m m 8 H ,.< . ",
"                  1 %.~ i %.j g d { M q A i h i { ~ #.A { b ( ( ( B B _ v._ v._ _ _ ( ( b r d _ ( / ^ d b d ] h , q n.z.z.z.z.z.N.q.q.q.Q.q.s.r.N.q.z.z.z.z.z.C.v.e h e b.h d j h f 5 ] p ' r K %.q [.[.M A [.A A [.A A [.5 h n M 5 L , 3 , 9 ,.4.[ 9 = % m %.' . ",
"                  1 u { 5 5 g i e { i h h ) M d i : j i ) ( M h ] ( M h 5 ( ( [.M M ( ( ( e h M b b i 5 M 5 b c ~ %.q ( _ _ v.C.q.z.z.z.z.z.N.z.z.C.C.o.v._ ( [.( b ( ( c p i n 3.%.j j h h 3.n h L h h h n n q g d ~ N d r j K K L [ ' ' [ ,.v , k k & Q m h y . ",
"                  1 0 { d 5 ~ q { g p 5 i : g { { g g h h h q A { 5 5 5 A ( ] { h 5 f h q i h p i h i [.%.#.5 h i { i d i q d.b 5 b M ( _ _ ( ( e 5 A A A M ( ^ d b g t L : i n [ L t ' c.c.4.,.r q i h n n d i c.4.' 9 K [ 4.k k ` k ,.,., K < ` &.9 $.& H r y - ",
"                  1 p { ~ ~ p i f d d j ~ ~ i d f f i g ~ t A h ) ~ 5 E { q c { f d h p 5 t #.) q i d j 4.: ) q j h g ~ ) f b ] ] e i 5 d e 5 b d ] ] g b { f b.! ) : %.p g #.%.r ! ' u p q j #.' L t : ! ' ' ! ' k ,.y ' 4.! %.3.,.,.,., ` ,., 4.y , 8 $.m 3.y . ",
"                  1 j f g ~ 4.4.j h f ~ h { ] ( ] { ( ] b ( b g 5 i 5 f ~ i h g d h %.p { ~ g j h { ~ h 5 5 p p h h i b ) g h g f j h h { i ,.g d h h : c.h p u e i u j j h t i g h t h 0 q h i ' %.j ' , 3.4.' h q h h 5 [.b i M ( 5 r ' ,.k [ , @.3 3 m 9 %.y . ",
"                  1 #.g g f Z 3.i h i d e h ( ( _ / _ _ _ ( ( ( ( ( _ 4 b c d c d j %.s e h h g 5 ] ~ d h i h g d g #.5 g h f f h h t A _ D ' #.%.e i 5 ~ b.p t j g ' L %.h d j : ~ j h h ' p t ' q d b b M f h M b { d 5 e ~ t A { f ( _ < ,.4.[ N 3 }.= 9 #.[ - ",
"                  V p x i i g { 5 g d g 5 c 0 _ v.v.v.v.B B a _ 4 ^ _ 4 _ 4 4 _ / / x ^ { ~ u 5 h 5 5 j : g ) i d 5 p n ~ f d { t q ~ 3.( ( h : 3.r t : j h d : j p p 5 h i g t r ) j r j g d f ] 4 M g A q A p ] / 4 _ B a a a v.A.a / ( x ' ,.' 4., 3 2 m L y - ",
"                  1 j M e g p n i f ~ j b 5 a q.N.P.N.q.N.C.q.C.s.o.s.A.A.v._ / / ( ( / ^ _ x i [.5 ) j i 5 f d t 0 g p A ] M ( ^ ] ( c 4 4 ^ 4 ] b ] c { g 5 e %.#.' L ' p h t g g r i { ( M h [.M { ^ _ B n.o.o.s.C.N.z.P.z.z.q.C.C.N.4 _ c y [ &.9 } }.m %.` + ",
"                                                                                                                                                                                                                                                                  ",
"                                                                                                                                                                                                                                                                  ",
"                                                                                                                                                                                                                                                                  ",
"                                                                                                                                                                                                                                                                  ",
"                                                                                                                                                                                                                                                                  ",
"                                                                                                                                                                                                                                                                  ",
"                                                                                                                                                                                                                                                                  ",
"                                                                                                                                                                                                                                                                  ",
"                                                                                                                                                                                                                                                                  ",
"                                                                                                                                                                                                                                                                  ",
"                                                                                                                                                                                                                                                                  ",
"                                                                                                                                                                                                                                                                  ",
"                                                                                                                                                                                                                                                                  ",
"                                                                                                                                                                                                                                                                  ",
"                                                                                                                                                                                                                                                                  ",
"                                                                                                                                                                                                                                                                  ",
"                                                                                                                                                                                                                                                                  ",
"                                                                                                                                                                                                                                                                  ",
"                                                                                                                                                                                                                                                                  ",
"                                                                                                                                                                                                                                                                  ",
"                                                                                                                                                                                                                                                                  ",
"                                                                                                                                                                                                                                                                  "};
