.subckt ddd (  )
_ ( ????? ????? )  ddd area
.model ddd d ( tnom=NA( 27.) is=NA( 10.f) rs=0. n=1. tt=0. cjo=1.p pb=1. mj=0.5 egap=1.11 xti=3. kf=0. af=1. fc=0.5 bv=50)
.ends ddd
.subckt dddd (  )
.ends dddd
.subckt main ( 1 2 )
r ( 1 2 )  resistor  =100.k
d ( 2 0 )  dddd  area=a
.ends main
m ( 1 2 )  main  a=a
#           v(1)       v(2)       y(m.d._)   y(m.d.ddd)
 0.         0.         0.         386.64f    ??        
 2.         2.         0.54568    562.29u    ??        
 4.         4.         0.56789    0.001327   ??        
 6.         6.         0.5797     0.0020957  ??        
 8.         8.         0.5878     0.0028658  ??        
 10.        10.        0.59396    0.0036367  ??        
