isource #(.dc(1)) i (.p(0),.n(1));
test_sckt4 #() dut (.a(1),.b(0));
Gnucap   System status
iterations: op=0, dc=0, tran=0, fourier=0, total=0
transient timesteps: accepted=0, rejected=0, total=0
nodes: user=1, subckt=0, model=3, total=4
dctran density=75.0%, ac density=75.0%
#           v(1)       i(i)      
 0.         4.         1.        
Gnucap   System status
iterations: op=0, dc=2, tran=0, fourier=0, total=2
transient timesteps: accepted=0, rejected=0, total=0
nodes: user=1, subckt=0, model=3, total=4
dctran density=75.0%, ac density=75.0%
