parameter v1=0 
test_af_0 #(.v(v1)) dut (.p(1),.n(0));
#           v(1)       iter(0)   
-5.         0.36788    3.        
-3.         0.54881    3.        
-1.         0.81873    3.        
 1.         1.2214     3.        
 3.         1.8221     3.        
 5.         2.7183     3.        
 7.         4.0552     3.        
 9.         6.0496     3.        
