nature current
  access = "I";
  units = "A";
  abstol = "0.001234";
endnature

nature voltage
  access = "V";
  units = "V";
  abstol = "0.0004321";
endnature


discipline electrical
  potential "voltage";
  flow "current";
enddiscipline


module cap(p, n);
  inout p, n;
  electrical p, n;
  parameter real c = 1.;

  analog begin
    I(p, n) <+ (c * ddt(V(p, n)));
  end

endmodule



