parameter r=1 
parameter v=0 
test_ddt5 #() dut (.p(1),.n(0));
isine #(.ampl(1),.offset(v)) v1 (.p(0),.n(1));
#Time       v(1)       d0(dut)    d1(dut)    iter(0)   
 0.         0.         0.         0.         3.        
 1.6745n    105.f      6.2832     0.         24.       
 2.7745n    174.f      6.2832     0.         3.        
 0.033333   2.0791u    6.1915     0.         3.        
 0.066667   4.0674u    5.738      0.         3.        
 0.11852    6.7773u    4.7147     0.         3.        
 0.17037    8.7743u    2.9878     0.         3.        
 0.22222    9.8481u    1.1541     0.         3.        
 0.3        9.5106u   -2.022      0.         3.        
 0.37778    6.9466u   -4.5711     0.         3.        
 0.50222   -139.62n   -6.8175     0.         3.        
 0.57333   -4.4464u   -5.2952     0.         3.        
 0.62667   -7.1447u   -4.8237     0.         3.        
 0.68      -9.0483u   -2.3146     0.         3.        
 0.73333   -9.9452u   -1.049      0.         3.        
 0.8       -9.5106u    2.3529     0.         3.        
 0.9       -5.8779u    4.9125     0.         3.        
 1.         0.         6.8432     0.         3.        
Gnucap   System status
iterations: op=0, dc=0, tran=75, fourier=0, total=100
transient timesteps: accepted=18, rejected=7, total=25
nodes: user=1, subckt=0, model=0, total=1
dctran density=100.0%, ac density=100.0%
