parameter v=0 
test_current4 #() dut (.p(1),.n(0),.c(2));
resistor #(.r(1)) v1 (.p(1),.n(0));
#           i(dut)     v(1)       v(2)      
 0.         0.         0.         0.        
-1.         0.        -1.         0.        
-2.         0.        -1.         0.        
 0.         0.        -1.         0.        
 0.         0.        -1.         0.        
-1.         0.        -1.         0.        
 0.5        0.        -1.         0.        
 0.         0.        -1.         0.        
-1.         0.        -1.         0.        
 1.         0.        -1.         0.        
