// it does work! I(cp,cn) is a short circuit. 
// (circuit doesn't make much sense) 
test_ccvs1 #() d1 (.p(1),.n(0),.cp(1),.cn(0));
vsource #(.dc(i)) v1 (.p(1),.n(0));
parameter i=1 
#           v(1)       i(v1)     
 0.         0.         0.        
 0.5       -1.6667u   -50.K      
 1.        -3.3334u   -100.K     
 1.5       -5.0001u   -150.K     
 2.        -6.6667u   -200.K     
