#           v(1)       v(2)       iter(0)   
 0.         0.         0.         3.        
#Freq       v(1)       v(2)       iter(0)   
 1.         0.99999    0.15718    0.        
 10.        0.99999    0.015913   0.        
 100.       0.99999    0.0015915  0.        
 1.K        0.99999    159.15u    0.        
Gnucap   System status
iterations: op=0, dc=3, tran=0, fourier=0, total=7
transient timesteps: accepted=0, rejected=0, total=0
nodes: user=2, subckt=0, model=1, total=3
dctran density=77.8%, ac density=77.8%
