<?xml version="1.0" encoding="UTF-8" standalone="no"?>
<!-- Created with Inkscape (http://www.inkscape.org/) -->

<svg
   xmlns:dc="http://purl.org/dc/elements/1.1/"
   xmlns:cc="http://creativecommons.org/ns#"
   xmlns:rdf="http://www.w3.org/1999/02/22-rdf-syntax-ns#"
   xmlns:svg="http://www.w3.org/2000/svg"
   xmlns="http://www.w3.org/2000/svg"
   xmlns:xlink="http://www.w3.org/1999/xlink"
   xmlns:sodipodi="http://sodipodi.sourceforge.net/DTD/sodipodi-0.dtd"
   xmlns:inkscape="http://www.inkscape.org/namespaces/inkscape"
   width="210mm"
   height="297mm"
   id="svg2"
   version="1.1"
   inkscape:version="0.48.5 r10040"
   sodipodi:docname="guile-first-steps-cover.svg"
   inkscape:export-filename="guile-first-steps.png"
   inkscape:export-xdpi="90"
   inkscape:export-ydpi="90">
  <title
     id="title3019">GNU Guile First Steps Guide Cover</title>
  <defs
     id="defs4">
    <linearGradient
       id="linearGradient4413">
      <stop
         style="stop-color:#9f0a14;stop-opacity:1;"
         offset="0"
         id="stop4415" />
      <stop
         style="stop-color:#d0343f;stop-opacity:1;"
         offset="1"
         id="stop4417" />
    </linearGradient>
    <linearGradient
       inkscape:collect="always"
       xlink:href="#linearGradient4413"
       id="linearGradient4465"
       gradientUnits="userSpaceOnUse"
       x1="-1177.1428"
       y1="1126.6479"
       x2="744.09448"
       y2="808.57141" />
    <filter
       height="1.5398304"
       y="-0.2699152"
       width="1.0214419"
       x="-0.010720931"
       id="filter3993"
       inkscape:collect="always">
      <feGaussianBlur
         id="feGaussianBlur3995"
         stdDeviation="0.67595846"
         inkscape:collect="always" />
    </filter>
    <linearGradient
       id="linearGradient4006">
      <stop
         id="stop4008"
         offset="0"
         style="stop-color:#d0343f;stop-opacity:1;" />
      <stop
         id="stop4010"
         offset="1"
         style="stop-color:#7a040d;stop-opacity:1;" />
    </linearGradient>
    <linearGradient
       inkscape:collect="always"
       xlink:href="#linearGradient4006"
       id="linearGradient8340"
       gradientUnits="userSpaceOnUse"
       gradientTransform="matrix(3.652719,0,0,3.652719,39.465756,-31.257233)"
       x1="13.84375"
       y1="119.89062"
       x2="13.368317"
       y2="138.89062" />
  </defs>
  <sodipodi:namedview
     id="base"
     pagecolor="#ffffff"
     bordercolor="#666666"
     borderopacity="1.0"
     inkscape:pageopacity="1"
     inkscape:pageshadow="2"
     inkscape:zoom="0.49497474"
     inkscape:cx="399.60655"
     inkscape:cy="481.71564"
     inkscape:document-units="px"
     inkscape:current-layer="layer1"
     showgrid="false"
     inkscape:showpageshadow="false"
     borderlayer="true"
     inkscape:window-width="1440"
     inkscape:window-height="824"
     inkscape:window-x="0"
     inkscape:window-y="24"
     inkscape:window-maximized="1"
     inkscape:snap-page="false"
     inkscape:snap-bbox="true"
     inkscape:bbox-nodes="true"
     inkscape:snap-global="false" />
  <metadata
     id="metadata7">
    <rdf:RDF>
      <cc:Work
         rdf:about="">
        <dc:format>image/svg+xml</dc:format>
        <dc:type
           rdf:resource="http://purl.org/dc/dcmitype/StillImage" />
        <dc:title>GNU Guile First Steps Guide Cover</dc:title>
        <dc:date>2015-10-01</dc:date>
        <dc:creator>
          <cc:Agent>
            <dc:title>Luis Felipe López Acevedo (sirgazil)</dc:title>
          </cc:Agent>
        </dc:creator>
        <dc:rights>
          <cc:Agent>
            <dc:title>Luis Felipe López Acevedo (sirgazil)</dc:title>
          </cc:Agent>
        </dc:rights>
        <cc:license
           rdf:resource="http://creativecommons.org/licenses/by-sa/4.0/" />
        <dc:language>en</dc:language>
      </cc:Work>
      <cc:License
         rdf:about="http://creativecommons.org/licenses/by-sa/3.0/">
        <cc:permits
           rdf:resource="http://creativecommons.org/ns#Reproduction" />
        <cc:permits
           rdf:resource="http://creativecommons.org/ns#Distribution" />
        <cc:requires
           rdf:resource="http://creativecommons.org/ns#Notice" />
        <cc:requires
           rdf:resource="http://creativecommons.org/ns#Attribution" />
        <cc:permits
           rdf:resource="http://creativecommons.org/ns#DerivativeWorks" />
        <cc:requires
           rdf:resource="http://creativecommons.org/ns#ShareAlike" />
      </cc:License>
    </rdf:RDF>
  </metadata>
  <g
     inkscape:label="Capa 1"
     inkscape:groupmode="layer"
     id="layer1">
    <path
       style="fill:url(#linearGradient4465);fill-opacity:1;stroke:none"
       d="M 0 808.5625 L 0 1052.375 L 744.09375 1052.375 L 744.09375 1041.4688 L 511.1875 808.5625 L 0 808.5625 z M 539.5 808.5625 L 744.09375 1013.1875 L 744.09375 984.875 L 567.75 808.5625 L 539.5 808.5625 z M 596.0625 808.5625 L 744.09375 956.625 L 744.09375 928.3125 L 624.3125 808.5625 L 596.0625 808.5625 z M 652.625 808.5625 L 744.09375 900.0625 L 744.09375 808.5625 L 652.625 808.5625 z "
       id="rect4388" />
    <text
       xml:space="preserve"
       style="font-size:72px;font-style:normal;font-variant:normal;font-weight:bold;font-stretch:normal;text-align:center;line-height:125%;letter-spacing:0px;word-spacing:0px;writing-mode:lr-tb;text-anchor:middle;fill:#333333;fill-opacity:1;stroke:none;font-family:DejaVu Sans;-inkscape-font-specification:DejaVu Sans Bold"
       x="371.95935"
       y="620.93359"
       id="text4421"
       sodipodi:linespacing="125%"><tspan
         sodipodi:role="line"
         x="371.95935"
         y="620.93359"
         id="tspan4425">GNU Guile 2.0</tspan></text>
    <text
       sodipodi:linespacing="125%"
       id="text4429"
       y="666.93359"
       x="371.87146"
       style="font-size:28px;font-style:normal;font-variant:normal;font-weight:normal;font-stretch:normal;text-align:center;line-height:125%;letter-spacing:0px;word-spacing:0px;writing-mode:lr-tb;text-anchor:middle;fill:#333333;fill-opacity:1;stroke:none;font-family:DejaVu Sans;-inkscape-font-specification:DejaVu Sans"
       xml:space="preserve"><tspan
         id="tspan4431"
         y="666.93359"
         x="371.87146"
         sodipodi:role="line">GNU's Programming and Extension Language</tspan></text>
    <text
       xml:space="preserve"
       style="font-size:48px;font-style:normal;font-variant:normal;font-weight:normal;font-stretch:normal;text-align:start;line-height:125%;letter-spacing:0px;word-spacing:0px;writing-mode:lr-tb;text-anchor:start;fill:#ffffff;fill-opacity:1;stroke:none;font-family:DejaVu Sans;-inkscape-font-specification:DejaVu Sans"
       x="40.605835"
       y="886.93359"
       id="text4468"
       sodipodi:linespacing="125%"><tspan
         sodipodi:role="line"
         x="40.605835"
         y="886.93359"
         id="tspan4470">First Steps Guide</tspan></text>
    <text
       xml:space="preserve"
       style="font-size:28px;font-style:normal;font-variant:normal;font-weight:normal;font-stretch:normal;text-align:center;line-height:125%;letter-spacing:0px;word-spacing:0px;writing-mode:lr-tb;text-anchor:middle;fill:#333333;fill-opacity:1;stroke:none;font-family:DejaVu Sans;-inkscape-font-specification:DejaVu Sans"
       x="371.87146"
       y="666.93359"
       id="text4480"
       sodipodi:linespacing="125%"><tspan
         sodipodi:role="line"
         x="371.87146"
         y="666.93359"
         id="tspan4482">GNU's Programming and Extension Language</tspan></text>
    <path
       sodipodi:type="arc"
       style="opacity:0.23299997;fill:#000000;fill-opacity:1;stroke:none;filter:url(#filter3993)"
       id="path3203"
       sodipodi:cx="91.216774"
       sodipodi:cy="136.53717"
       sodipodi:rx="75.660423"
       sodipodi:ry="3.0052037"
       d="m 166.8772,136.53717 a 75.660423,3.0052037 0 1 1 -151.320849,0 75.660423,3.0052037 0 1 1 151.320849,0 z"
       transform="matrix(3.8490099,0,0,3.954028,20.952973,-64.262557)" />
    <path
       inkscape:connector-curvature="0"
       style="fill:#1a1a1a;fill-opacity:1;stroke:none"
       d="m 488.52192,138.25176 c -2.65319,-0.005 -5.52732,0.16718 -8.6752,0.57074 0,0 -88.74597,141.5491 -199.64392,212.20015 -22.16665,9.75641 -45.72052,16.6362 -70.31485,18.94847 0,0 -76.66442,-24.69723 -101.70544,0.91319 0.69728,0.46832 105.08527,70.24716 375.20278,48.17022 85.84485,-7.01617 142.38609,-14.33286 180.1247,-21.00311 -2.12536,-21.98752 -8.07145,-49.8722 -22.25876,-82.30035 -36.16004,-82.65159 3.88103,-143.36921 3.88103,-143.36921 l 6.50639,27.16709 9.01766,-7.76203 -15.52405,-32.30373 c 0,0 -8.45495,50.88589 -130.81301,24.08511 l 0.34226,-2.16879 c 0,0 13.65781,-43.07681 -26.13976,-43.14775 z"
       id="path3187" />
    <path
       style="fill:url(#linearGradient8340);fill-opacity:1;stroke:none"
       d="m 109.55233,369.62869 c -1.03849,0.92661 -2.08546,1.88944 -2.96779,2.96783 l -11.643101,7.76203 -6.734748,42.12041 c 46.966569,27.79033 112.233149,45.34753 190.169749,55.93226 l 369.3812,-3.88101 13.01282,-22.6012 c 0,0 6.08167,-19.91034 2.73953,-54.10591 -37.39039,6.72871 -94.07552,14.12395 -181.03787,21.23143 -268.61768,21.95435 -372.00655,-47.82778 -372.00655,-47.82778 l -0.91324,-1.59806 z"
       id="path3194"
       inkscape:connector-curvature="0" />
    <rect
       style="fill:#d0343f;fill-opacity:1;stroke:none"
       id="rect3197"
       width="54.240116"
       height="27.120058"
       x="434.06366"
       y="-42.770313"
       rx="2.9999998"
       ry="2.9999998"
       transform="matrix(0.56830822,0.82281576,-0.82281576,0.56830822,0,0)" />
    <rect
       transform="matrix(0.62703336,0.77899241,-0.77899241,0.62703336,0,0)"
       ry="2.9999998"
       rx="2.9999998"
       y="-92.422958"
       x="434.20633"
       height="27.120058"
       width="54.240116"
       id="rect3199"
       style="fill:#d0343f;fill-opacity:1;stroke:none" />
    <rect
       style="fill:#d0343f;fill-opacity:1;stroke:none"
       id="rect3201"
       width="54.240112"
       height="27.120056"
       x="435.33997"
       y="-145.16048"
       rx="2.9999998"
       ry="2.9999998"
       transform="matrix(0.67370716,0.73899842,-0.73899842,0.67370716,0,0)" />
    <path
       style="fill:none;stroke:#ffffff;stroke-width:3.65271926px;stroke-linecap:butt;stroke-linejoin:miter;stroke-opacity:1"
       d="m 663.22702,434.54319 c 0,0 -423.58942,58.11437 -570.812597,-36.16008"
       id="path4002"
       inkscape:connector-curvature="0"
       sodipodi:nodetypes="cc" />
    <path
       inkscape:connector-curvature="0"
       id="path4014"
       d="M 663.50999,397.8231 C 626.1196,404.55181 569.43447,411.94705 482.47212,419.05453 213.85444,441.00888 108.86744,371.22675 108.86744,371.22675"
       style="fill:none;stroke:#d06a6e;stroke-width:3.65271926;stroke-opacity:1"
       sodipodi:nodetypes="csc" />
    <path
       inkscape:connector-curvature="0"
       id="path4016"
       d="m 88.206691,422.47896 c 46.966569,27.79033 112.233149,45.34753 190.169749,55.93226 l 369.3812,-3.88101"
       style="fill:none;stroke:#640e12;stroke-width:3.65271926;stroke-opacity:1"
       sodipodi:nodetypes="ccc" />
    <path
       sodipodi:type="arc"
       style="fill:none;stroke:#ffffff;stroke-width:2;stroke-linecap:butt;stroke-miterlimit:4;stroke-opacity:1;stroke-dasharray:none;stroke-dashoffset:0"
       id="path4018"
       sodipodi:cx="68.589355"
       sodipodi:cy="111.87682"
       sodipodi:rx="4.4194174"
       sodipodi:ry="3.9774756"
       d="m 73.008773,111.87682 a 4.4194174,3.9774756 0 1 1 -8.838835,0 4.4194174,3.9774756 0 1 1 8.838835,0 z"
       transform="matrix(3.652719,0,0,3.652719,42.048614,-37.068667)" />
    <path
       transform="matrix(3.652719,0,0,3.652719,108.55733,-86.143052)"
       d="m 73.008773,111.87682 a 4.4194174,3.9774756 0 1 1 -8.838835,0 4.4194174,3.9774756 0 1 1 8.838835,0 z"
       sodipodi:ry="3.9774756"
       sodipodi:rx="4.4194174"
       sodipodi:cy="111.87682"
       sodipodi:cx="68.589355"
       id="path4020"
       style="fill:none;stroke:#ffffff;stroke-width:2;stroke-linecap:butt;stroke-miterlimit:4;stroke-opacity:1;stroke-dasharray:none;stroke-dashoffset:0"
       sodipodi:type="arc" />
    <path
       sodipodi:type="arc"
       style="fill:none;stroke:#ffffff;stroke-width:2;stroke-linecap:butt;stroke-miterlimit:4;stroke-opacity:1;stroke-dasharray:none;stroke-dashoffset:0"
       id="path4022"
       sodipodi:cx="68.589355"
       sodipodi:cy="111.87682"
       sodipodi:rx="4.4194174"
       sodipodi:ry="3.9774756"
       d="m 73.008773,111.87682 a 4.4194174,3.9774756 0 1 1 -8.838835,0 4.4194174,3.9774756 0 1 1 8.838835,0 z"
       transform="matrix(3.652719,0,0,3.652719,167.3175,-144.90318)" />
    <g
       id="g4402"
       transform="matrix(0.43203563,0,0,0.43203563,373.11272,81.184132)">
      <path
         sodipodi:nodetypes="csccscc"
         inkscape:connector-curvature="0"
         id="path4098"
         d="m 355.63755,403.1084 c -60.81215,8.0242 -107.73317,60.06888 -107.73317,123.07266 0,63.0037 46.92102,115.04852 107.73317,123.07272 l 0,-36.11915 c -41.0188,-7.69458 -72.05993,-43.70086 -72.05993,-86.95357 0,-43.25265 31.04113,-79.25908 72.05993,-86.95351 z"
         style="fill:#d0343f;fill-opacity:1;stroke:none" />
      <path
         sodipodi:nodetypes="ccsccsc"
         inkscape:connector-curvature="0"
         style="fill:#333333;fill-opacity:1;stroke:none"
         d="m 388.45693,403.1084 0,36.11915 c 41.01878,7.69443 72.05993,43.70086 72.05993,86.95351 0,43.25271 -31.04115,79.25899 -72.05993,86.95357 l 0,36.11915 c 60.81215,-8.0242 107.73317,-60.06902 107.73317,-123.07272 0,-63.00378 -46.92102,-115.04846 -107.73317,-123.07266 z"
         id="path4100" />
      <text
         sodipodi:linespacing="125%"
         id="text4102"
         y="585.56378"
         x="371.39188"
         style="font-size:160.71141052px;font-style:normal;font-variant:normal;font-weight:600;font-stretch:normal;text-align:center;line-height:125%;letter-spacing:0px;word-spacing:0px;text-anchor:middle;fill:#ffffff;fill-opacity:1;stroke:none;font-family:URW Gothic L;-inkscape-font-specification:URW Gothic L Semi-Bold"
         xml:space="preserve"><tspan
           y="585.56378"
           x="371.39188"
           id="tspan4104"
           sodipodi:role="line">G</tspan></text>
    </g>
  </g>
</svg>
