<?xml version="1.0" encoding="UTF-8" standalone="no"?>
<!-- Created with Inkscape (http://www.inkscape.org/) -->

<svg
   xmlns:dc="http://purl.org/dc/elements/1.1/"
   xmlns:cc="http://creativecommons.org/ns#"
   xmlns:rdf="http://www.w3.org/1999/02/22-rdf-syntax-ns#"
   xmlns:svg="http://www.w3.org/2000/svg"
   xmlns="http://www.w3.org/2000/svg"
   xmlns:sodipodi="http://sodipodi.sourceforge.net/DTD/sodipodi-0.dtd"
   xmlns:inkscape="http://www.inkscape.org/namespaces/inkscape"
   width="100.47163mm"
   height="17.497mm"
   viewBox="0 0 356.00186 61.997247"
   id="svg2"
   version="1.1"
   inkscape:version="0.92.1 r15371"
   sodipodi:docname="banner-slim.svg">
  <defs
     id="defs4" />
  <sodipodi:namedview
     id="base"
     pagecolor="#ffffff"
     bordercolor="#666666"
     borderopacity="1.0"
     inkscape:pageopacity="0.0"
     inkscape:pageshadow="2"
     inkscape:zoom="0.98994949"
     inkscape:cx="81.694488"
     inkscape:cy="150.00474"
     inkscape:document-units="px"
     inkscape:current-layer="g4409"
     showgrid="false"
     showborder="true"
     inkscape:window-width="1278"
     inkscape:window-height="798"
     inkscape:window-x="1"
     inkscape:window-y="1"
     inkscape:window-maximized="0"
     fit-margin-top="0"
     fit-margin-left="0"
     fit-margin-right="0"
     fit-margin-bottom="0" />
  <metadata
     id="metadata7">
    <rdf:RDF>
      <cc:Work
         rdf:about="">
        <dc:format>image/svg+xml</dc:format>
        <dc:type
           rdf:resource="http://purl.org/dc/dcmitype/StillImage" />
        <dc:title></dc:title>
        <cc:license
           rdf:resource="http://creativecommons.org/licenses/by-sa/4.0/" />
      </cc:Work>
      <cc:License
         rdf:about="http://creativecommons.org/licenses/by-sa/4.0/">
        <cc:permits
           rdf:resource="http://creativecommons.org/ns#Reproduction" />
        <cc:permits
           rdf:resource="http://creativecommons.org/ns#Distribution" />
        <cc:requires
           rdf:resource="http://creativecommons.org/ns#Notice" />
        <cc:requires
           rdf:resource="http://creativecommons.org/ns#Attribution" />
        <cc:permits
           rdf:resource="http://creativecommons.org/ns#DerivativeWorks" />
        <cc:requires
           rdf:resource="http://creativecommons.org/ns#ShareAlike" />
      </cc:License>
    </rdf:RDF>
  </metadata>
  <g
     inkscape:groupmode="layer"
     id="layer4"
     inkscape:label="background"
     transform="translate(-22.000028,-171.96619)" />
  <g
     inkscape:label="boot"
     inkscape:groupmode="layer"
     id="layer1"
     transform="translate(-113.5236,-244.12425)" />
  <g
     inkscape:groupmode="layer"
     id="layer3"
     inkscape:label="pulleys"
     style="display:inline"
     transform="translate(-113.5236,-244.12425)" />
  <g
     inkscape:groupmode="layer"
     id="layer2"
     inkscape:label="strap"
     style="display:inline"
     transform="translate(-113.5236,-244.12425)">
    <g
       id="g4409"
       transform="matrix(0.60542205,0,0,0.60542205,44.793896,120.78879)">
      <path
         sodipodi:nodetypes="cssssccsssscsscccsscscssssssssssc"
         inkscape:connector-curvature="0"
         d="m 115.43033,269.76926 c 0,0 7.43865,11.8132 16.50857,15.00366 6.72736,2.36644 11.6964,4.18106 19.62057,5.29884 6.91677,0.97568 14.92029,-1.77714 22.27729,-0.33145 3.99824,0.78568 10.39275,6.14924 17.77719,8.41974 8.19586,2.52 17.29278,1.86163 18.86678,0.43869 m -44.44737,-9.36081 c 0,0 -13.35243,-3.91431 -14.53442,-9.5987 -1.13541,-5.46033 0.19378,-15.12046 9.12867,-14.02164 4.43134,0.54496 11.09596,-1.05427 14.6009,-2.76401 4.95429,-2.41674 9.52808,-7.55308 14.15707,-10.51802 6.02667,-3.8602 10.45205,-14.22793 12.01904,-13.04926 0,0 2.94884,5.64054 13.12156,9.86985 2.56718,1.06731 8.43343,3.56042 11.92613,3.32691 3.42035,-0.22867 4.39714,-3.76277 4.39714,-3.76277 l -0.35685,0.84552 m -19.62585,48.78276 c 0,0 6.03568,-9.48887 7.82077,-16.02671 1.30435,-4.77711 0.81289,-12.27292 2.29423,-16.99814 1.92488,-6.14004 7.94696,-12.01031 9.85348,-16.59986 -1.01774,-6.30804 -8.8699,-9.31859 -14.36987,-12.4814 -6.23348,-3.58462 -20.41797,-6.96116 -20.41797,-6.96116 0,0 -8.74573,14.42761 -15.32734,19.37837 -7.96497,5.99134 -17.83055,9.76317 -27.67519,11.31886 -7.59635,1.20041 -16.894,-2.55046 -24.93034,-0.43014 -3.79296,1.00075 -7.00481,2.9638 -10.13478,5.9815 -1.58503,1.52816 -0.96227,2.8316 -2.25927,4.07066 -3.51128,3.35447 -0.13534,8.98919 2.56848,12.02202 7.52916,8.44535 18.43636,11.10103 29.53659,13.29125 7.34173,1.44862 14.928,-1.28272 22.44801,0.28592 6.60932,1.37867 13.57103,6.41901 20.07511,8.23028 5.50113,1.53197 11.10738,3.09206 15.94436,0.87062 2.27381,-1.04427 4.57373,-5.95207 4.57373,-5.95207 z"
         style="fill:none;fill-rule:evenodd;stroke:#000000;stroke-width:1.41182423;stroke-linecap:butt;stroke-linejoin:miter;stroke-miterlimit:4;stroke-dasharray:none;stroke-opacity:1"
         id="path4159-3"
         transform="translate(-4.0506463e-6,-2.1425481e-6)" />
      <circle
         transform="matrix(-0.8343289,-0.55126698,-0.55126698,0.8343289,-4.0506463e-6,-2.1425481e-6)"
         r="1.5891345"
         cy="106.03455"
         cx="-301.01883"
         id="path4178"
         style="color:#000000;clip-rule:nonzero;display:inline;overflow:visible;visibility:visible;opacity:1;isolation:auto;mix-blend-mode:normal;color-interpolation:sRGB;color-interpolation-filters:linearRGB;solid-color:#000000;solid-opacity:1;fill:none;fill-opacity:1;fill-rule:nonzero;stroke:#000000;stroke-width:1.05886817;stroke-linecap:butt;stroke-linejoin:miter;stroke-miterlimit:4;stroke-dasharray:none;stroke-dashoffset:0;stroke-opacity:1;color-rendering:auto;image-rendering:auto;shape-rendering:auto;text-rendering:auto;enable-background:accumulate" />
      <circle
         transform="matrix(-0.8343289,-0.55126698,-0.55126698,0.8343289,-4.0506463e-6,-2.1425481e-6)"
         r="1.5891345"
         cy="113.97942"
         cx="-298.61157"
         id="path4178-6"
         style="color:#000000;clip-rule:nonzero;display:inline;overflow:visible;visibility:visible;opacity:1;isolation:auto;mix-blend-mode:normal;color-interpolation:sRGB;color-interpolation-filters:linearRGB;solid-color:#000000;solid-opacity:1;fill:none;fill-opacity:1;fill-rule:nonzero;stroke:#000000;stroke-width:1.05886817;stroke-linecap:butt;stroke-linejoin:miter;stroke-miterlimit:4;stroke-dasharray:none;stroke-dashoffset:0;stroke-opacity:1;color-rendering:auto;image-rendering:auto;shape-rendering:auto;text-rendering:auto;enable-background:accumulate" />
      <circle
         transform="matrix(-0.8343289,-0.55126698,-0.55126698,0.8343289,-4.0506463e-6,-2.1425481e-6)"
         r="1.5891345"
         cy="121.79488"
         cx="-295.58624"
         id="path4178-6-7"
         style="color:#000000;clip-rule:nonzero;display:inline;overflow:visible;visibility:visible;opacity:1;isolation:auto;mix-blend-mode:normal;color-interpolation:sRGB;color-interpolation-filters:linearRGB;solid-color:#000000;solid-opacity:1;fill:none;fill-opacity:1;fill-rule:nonzero;stroke:#000000;stroke-width:1.05886817;stroke-linecap:butt;stroke-linejoin:miter;stroke-miterlimit:4;stroke-dasharray:none;stroke-dashoffset:0;stroke-opacity:1;color-rendering:auto;image-rendering:auto;shape-rendering:auto;text-rendering:auto;enable-background:accumulate" />
      <circle
         transform="matrix(-0.8343289,-0.55126698,-0.55126698,0.8343289,-4.0506463e-6,-2.1425481e-6)"
         r="1.5891345"
         cy="128.85399"
         cx="-291.17429"
         id="path4178-6-7-5"
         style="color:#000000;clip-rule:nonzero;display:inline;overflow:visible;visibility:visible;opacity:1;isolation:auto;mix-blend-mode:normal;color-interpolation:sRGB;color-interpolation-filters:linearRGB;solid-color:#000000;solid-opacity:1;fill:none;fill-opacity:1;fill-rule:nonzero;stroke:#000000;stroke-width:1.05886817;stroke-linecap:butt;stroke-linejoin:miter;stroke-miterlimit:4;stroke-dasharray:none;stroke-dashoffset:0;stroke-opacity:1;color-rendering:auto;image-rendering:auto;shape-rendering:auto;text-rendering:auto;enable-background:accumulate" />
      <circle
         transform="matrix(-0.8343289,-0.55126698,-0.55126698,0.8343289,-4.0506463e-6,-2.1425481e-6)"
         r="1.5891345"
         cy="97.844315"
         cx="-302.39325"
         id="path4178-3"
         style="color:#000000;clip-rule:nonzero;display:inline;overflow:visible;visibility:visible;opacity:1;isolation:auto;mix-blend-mode:normal;color-interpolation:sRGB;color-interpolation-filters:linearRGB;solid-color:#000000;solid-opacity:1;fill:none;fill-opacity:1;fill-rule:nonzero;stroke:#000000;stroke-width:1.05886817;stroke-linecap:butt;stroke-linejoin:miter;stroke-miterlimit:4;stroke-dasharray:none;stroke-dashoffset:0;stroke-opacity:1;color-rendering:auto;image-rendering:auto;shape-rendering:auto;text-rendering:auto;enable-background:accumulate" />
      <circle
         transform="matrix(-0.8343289,-0.55126698,-0.55126698,0.8343289,-4.0506463e-6,-2.1425481e-6)"
         r="1.5891345"
         cy="93.27935"
         cx="-292.80392"
         id="path4178-3-5"
         style="color:#000000;clip-rule:nonzero;display:inline;overflow:visible;visibility:visible;opacity:1;isolation:auto;mix-blend-mode:normal;color-interpolation:sRGB;color-interpolation-filters:linearRGB;solid-color:#000000;solid-opacity:1;fill:none;fill-opacity:1;fill-rule:nonzero;stroke:#000000;stroke-width:1.05886817;stroke-linecap:butt;stroke-linejoin:miter;stroke-miterlimit:4;stroke-dasharray:none;stroke-dashoffset:0;stroke-opacity:1;color-rendering:auto;image-rendering:auto;shape-rendering:auto;text-rendering:auto;enable-background:accumulate" />
      <circle
         transform="matrix(-0.8343289,-0.55126698,-0.55126698,0.8343289,-4.0506463e-6,-2.1425481e-6)"
         r="1.5891345"
         cy="101.30148"
         cx="-292.26913"
         id="path4178-3-5-6"
         style="color:#000000;clip-rule:nonzero;display:inline;overflow:visible;visibility:visible;opacity:1;isolation:auto;mix-blend-mode:normal;color-interpolation:sRGB;color-interpolation-filters:linearRGB;solid-color:#000000;solid-opacity:1;fill:none;fill-opacity:1;fill-rule:nonzero;stroke:#000000;stroke-width:1.05886817;stroke-linecap:butt;stroke-linejoin:miter;stroke-miterlimit:4;stroke-dasharray:none;stroke-dashoffset:0;stroke-opacity:1;color-rendering:auto;image-rendering:auto;shape-rendering:auto;text-rendering:auto;enable-background:accumulate" />
      <circle
         transform="matrix(-0.8343289,-0.55126698,-0.55126698,0.8343289,-4.0506463e-6,-2.1425481e-6)"
         r="1.5891345"
         cy="108.25399"
         cx="-290.6647"
         id="path4178-3-5-6-2"
         style="color:#000000;clip-rule:nonzero;display:inline;overflow:visible;visibility:visible;opacity:1;isolation:auto;mix-blend-mode:normal;color-interpolation:sRGB;color-interpolation-filters:linearRGB;solid-color:#000000;solid-opacity:1;fill:none;fill-opacity:1;fill-rule:nonzero;stroke:#000000;stroke-width:1.05886817;stroke-linecap:butt;stroke-linejoin:miter;stroke-miterlimit:4;stroke-dasharray:none;stroke-dashoffset:0;stroke-opacity:1;color-rendering:auto;image-rendering:auto;shape-rendering:auto;text-rendering:auto;enable-background:accumulate" />
      <path
         sodipodi:nodetypes="cscsccsc"
         inkscape:connector-curvature="0"
         id="rect4285"
         d="m 240.97721,246.66457 c 0,0 -0.49537,-0.81661 -0.96228,-1.30834 -0.53422,-0.56261 -1.54496,-1.20294 -1.54496,-1.20294 0,0 -2.50595,0.27579 -3.83263,0.52524 -1.56837,0.29489 -4.85251,1.10777 -4.85251,1.10777 l 1.51787,2.39175 c 0,0 2.97751,-1.13307 4.53224,-1.44459 1.8487,-0.37043 5.14227,-0.0689 5.14227,-0.0689 z"
         style="color:#000000;clip-rule:nonzero;display:inline;overflow:visible;visibility:visible;opacity:1;isolation:auto;mix-blend-mode:normal;color-interpolation:sRGB;color-interpolation-filters:linearRGB;solid-color:#000000;solid-opacity:1;fill:#000000;fill-opacity:1;fill-rule:nonzero;stroke:none;stroke-width:3;stroke-linecap:butt;stroke-linejoin:miter;stroke-miterlimit:4;stroke-dasharray:none;stroke-dashoffset:0;stroke-opacity:1;color-rendering:auto;image-rendering:auto;shape-rendering:auto;text-rendering:auto;enable-background:accumulate"
         transform="translate(-4.0506463e-6,-2.1425481e-6)" />
      <path
         sodipodi:nodetypes="ccscsasc"
         inkscape:connector-curvature="0"
         id="rect4288"
         d="m 219.06263,275.76342 c 0,0 -0.58025,3.23661 -3.18814,2.85992 -1.30455,1.99533 -11.24223,-0.0791 -14.0189,-0.027 -2.91012,0.0546 -8.73172,-0.0537 -8.73172,-0.0537 0,0 -3.49741,0.15087 -2.94153,1.0283 1.00241,1.58227 8.47334,1.8567 12.68694,2.88305 4.80731,1.17096 11.14509,5.39258 14.36586,3.73564 1.50026,-0.77183 1.82749,-10.42617 1.82749,-10.42617 z"
         style="color:#000000;clip-rule:nonzero;display:inline;overflow:visible;visibility:visible;opacity:1;isolation:auto;mix-blend-mode:normal;color-interpolation:sRGB;color-interpolation-filters:linearRGB;solid-color:#000000;solid-opacity:1;fill:#000000;fill-opacity:1;fill-rule:nonzero;stroke:none;stroke-width:3;stroke-linecap:butt;stroke-linejoin:miter;stroke-miterlimit:4;stroke-dasharray:none;stroke-dashoffset:0;stroke-opacity:1;color-rendering:auto;image-rendering:auto;shape-rendering:auto;text-rendering:auto;enable-background:accumulate"
         transform="translate(-4.0506463e-6,-2.1425481e-6)" />
      <path
         sodipodi:nodetypes="ccacsscscc"
         inkscape:connector-curvature="0"
         id="rect4288-9"
         d="m 152.46523,271.03812 c 0,0 -1.41869,-10.91253 -4.02658,-11.28923 -1.30455,1.99533 -12.84531,-2.34658 -18.99989,-0.82741 -4.16763,1.02871 -11.12751,6.48271 -11.12751,6.48271 l -2.06505,5.01522 c -0.84063,2.04158 5.47984,8.0406 9.28266,10.86379 5.59125,4.15091 10.83194,4.99773 11.13653,5.63005 4.80691,0.22813 9.92542,1.77219 12.17773,2.67446 0,0 6.35428,1.41839 15.87945,-0.24343 -17.59001,-6.54388 -14.66186,-13.87154 -12.25734,-18.30616 z"
         style="color:#000000;clip-rule:nonzero;display:inline;overflow:visible;visibility:visible;opacity:1;isolation:auto;mix-blend-mode:normal;color-interpolation:sRGB;color-interpolation-filters:linearRGB;solid-color:#000000;solid-opacity:1;fill:#000000;fill-opacity:1;fill-rule:nonzero;stroke:none;stroke-width:3;stroke-linecap:butt;stroke-linejoin:miter;stroke-miterlimit:4;stroke-dasharray:none;stroke-dashoffset:0;stroke-opacity:1;color-rendering:auto;image-rendering:auto;shape-rendering:auto;text-rendering:auto;enable-background:accumulate"
         transform="translate(-4.0506463e-6,-2.1425481e-6)" />
      <circle
         r="8.544878"
         cy="215.71735"
         cx="526.30743"
         id="path4317-3"
         style="color:#000000;clip-rule:nonzero;display:inline;overflow:visible;visibility:visible;opacity:1;isolation:auto;mix-blend-mode:normal;color-interpolation:sRGB;color-interpolation-filters:linearRGB;solid-color:#000000;solid-opacity:1;fill:none;fill-opacity:1;fill-rule:nonzero;stroke:#000000;stroke-width:2.82364845;stroke-linecap:butt;stroke-linejoin:miter;stroke-miterlimit:4;stroke-dasharray:none;stroke-dashoffset:0;stroke-opacity:1;color-rendering:auto;image-rendering:auto;shape-rendering:auto;text-rendering:auto;enable-background:accumulate"
         transform="translate(-4.0506463e-6,-2.1425481e-6)" />
      <path
         sodipodi:nodetypes="ccccc"
         inkscape:connector-curvature="0"
         id="path4542"
         d="m 187.71061,245.14035 329.99322,-38.98654 c 0,0 8.63198,-1.69239 12.68535,-0.47775 34.99274,21.40851 79.61939,57.09255 107.32143,76.60714 l 0,0"
         style="display:inline;fill:none;fill-rule:evenodd;stroke:#ff00ff;stroke-width:3.00000024;stroke-linecap:butt;stroke-linejoin:miter;stroke-miterlimit:4;stroke-dasharray:none;stroke-dashoffset:0;stroke-opacity:1"
         transform="translate(-4.0506463e-6,-2.1425481e-6)" />
      <path
         sodipodi:nodetypes="cc"
         inkscape:connector-curvature="0"
         id="path4323"
         d="m 171.70196,268.12297 -2.889,-10.78189"
         style="fill:none;fill-rule:evenodd;stroke:#ff00ff;stroke-width:2.82364845;stroke-linecap:butt;stroke-linejoin:miter;stroke-miterlimit:4;stroke-dasharray:none;stroke-opacity:1" />
      <path
         inkscape:transform-center-y="-2.0168914"
         inkscape:transform-center-x="-1.5126698"
         sodipodi:nodetypes="cc"
         inkscape:connector-curvature="0"
         id="path4323-1"
         d="m 179.56459,263.96338 -7.92487,-8.08632"
         style="fill:none;fill-rule:evenodd;stroke:#ff00ff;stroke-width:2.82364845;stroke-linecap:butt;stroke-linejoin:miter;stroke-miterlimit:4;stroke-dasharray:none;stroke-opacity:1" />
      <path
         inkscape:transform-center-y="-2.5150047"
         inkscape:transform-center-x="-0.17540053"
         sodipodi:nodetypes="cc"
         inkscape:connector-curvature="0"
         id="path4323-1-2"
         d="m 185.94704,259.39648 -3.4475,-9.65504"
         style="fill:none;fill-rule:evenodd;stroke:#ff00ff;stroke-width:2.82364845;stroke-linecap:butt;stroke-linejoin:miter;stroke-miterlimit:4;stroke-dasharray:none;stroke-opacity:1" />
      <path
         inkscape:transform-center-y="-2.0168905"
         inkscape:transform-center-x="-1.5126682"
         sodipodi:nodetypes="cc"
         inkscape:connector-curvature="0"
         id="path4323-1-7"
         d="m 179.18643,264.21549 3.54619,-14.26305"
         style="fill:none;fill-rule:evenodd;stroke:#ff00ff;stroke-width:2.82364845;stroke-linecap:butt;stroke-linejoin:miter;stroke-miterlimit:4;stroke-dasharray:none;stroke-opacity:1" />
      <path
         inkscape:transform-center-y="-2.5150016"
         inkscape:transform-center-x="-0.17540159"
         sodipodi:nodetypes="cc"
         inkscape:connector-curvature="0"
         id="path4323-1-2-0"
         d="m 186.21284,259.32734 1.86212,-14.48655"
         style="fill:none;fill-rule:evenodd;stroke:#ff00ff;stroke-width:2.82364845;stroke-linecap:butt;stroke-linejoin:miter;stroke-miterlimit:4;stroke-dasharray:none;stroke-opacity:1" />
      <path
         sodipodi:nodetypes="cc"
         inkscape:connector-curvature="0"
         id="path4447"
         d="m 608.84237,295.08385 92.70386,0"
         style="fill:none;fill-rule:evenodd;stroke:#000000;stroke-width:1.76478028;stroke-linecap:butt;stroke-linejoin:miter;stroke-miterlimit:4;stroke-dasharray:none;stroke-opacity:1" />
      <path
         sodipodi:nodetypes="ccccccc"
         inkscape:connector-curvature="0"
         id="path4459"
         d="m 623.29558,293.40672 c 0.50423,0.37816 4.67565,0.58178 4.67565,0.58178 l 4.94556,-3.78846 7.76444,-2.88617 5.5222,-8.63033 -8.03768,1.09572 -7.71295,-0.61946"
         style="fill:none;fill-rule:evenodd;stroke:#000000;stroke-width:1.05886817;stroke-linecap:butt;stroke-linejoin:miter;stroke-miterlimit:4;stroke-dasharray:none;stroke-opacity:1" />
      <path
         sodipodi:nodetypes="ccc"
         inkscape:connector-curvature="0"
         id="path4465"
         d="m 628.60767,275.15167 9.26893,2.32374 8.02323,0.70684"
         style="fill:none;fill-rule:evenodd;stroke:#000000;stroke-width:0.35295606px;stroke-linecap:butt;stroke-linejoin:miter;stroke-opacity:1" />
      <path
         sodipodi:nodetypes="cccc"
         inkscape:connector-curvature="0"
         id="path4467"
         d="m 628.78594,294.31566 2.58491,-0.80221 4.51542,-3.45226 5.37855,-2.69805"
         style="fill:none;fill-rule:evenodd;stroke:#000000;stroke-width:0.35295606px;stroke-linecap:butt;stroke-linejoin:miter;stroke-opacity:1" />
      <ellipse
         transform="matrix(0.87616356,0.48201392,-0.54908076,0.8357693,0,0)"
         cx="695.35815"
         cy="-62.856232"
         rx="1.9540629"
         ry="5.9473672"
         id="path4469"
         style="color:#000000;clip-rule:nonzero;display:inline;overflow:visible;visibility:visible;opacity:1;isolation:auto;mix-blend-mode:normal;color-interpolation:sRGB;color-interpolation-filters:linearRGB;solid-color:#000000;solid-opacity:1;fill:#000000;fill-opacity:1;fill-rule:nonzero;stroke:none;stroke-width:3;stroke-linecap:butt;stroke-linejoin:miter;stroke-miterlimit:4;stroke-dasharray:none;stroke-dashoffset:0;stroke-opacity:1;color-rendering:auto;image-rendering:auto;shape-rendering:auto;text-rendering:auto;enable-background:accumulate" />
      <g
         aria-label="Bootstrappable Builds"
         style="font-style:normal;font-weight:normal;line-height:0%;font-family:sans-serif;letter-spacing:0px;word-spacing:0px;fill:#000000;fill-opacity:1;stroke:none;stroke-width:1px;stroke-linecap:butt;stroke-linejoin:miter;stroke-opacity:1"
         id="text4471">
        <path
           d="m 254.72308,288.34668 v -41.50763 h 5.36493 c 3.61427,0 6.43792,0.67767 8.30152,2.42834 1.86361,1.75066 2.82365,4.46136 2.82365,8.58389 0,1.97655 -0.16942,3.44485 -0.79062,4.8002 -0.6212,1.35535 -1.58124,2.48481 -2.99307,3.78369 1.52477,0.84709 2.65423,2.42834 3.5578,5.08256 0.45178,1.29888 0.67768,2.99307 0.67768,5.08257 0,3.10602 -0.56473,5.87319 -1.97656,8.01916 -1.41182,2.14598 -3.84016,3.5578 -7.45443,3.72722 z m 6.09908,-24.39632 c 0.50825,0 1.69419,0.0565 2.7107,-0.62121 1.01651,-0.67767 1.80713,-2.03302 1.80713,-4.91314 0,-2.88013 -0.79062,-4.23548 -1.80713,-4.91315 -1.01651,-0.67768 -2.20245,-0.6212 -2.7107,-0.6212 z m 0,18.35371 c 0.50825,0 1.69419,0.11295 2.7107,-0.6212 1.01651,-0.73415 1.80713,-2.37187 1.80713,-5.76024 0,-3.38838 -0.79062,-5.0261 -1.80713,-5.76025 -1.01651,-0.73414 -2.20245,-0.6212 -2.7107,-0.6212 z"
           style="font-size:56.47296906px;fill:#ff00ff"
           id="path5347" />
        <path
           d="m 289.35689,280.83577 c -0.16942,2.99307 -1.07299,5.08257 -3.04954,6.72029 -1.01651,0.84709 -2.42834,1.2424 -4.29195,1.2424 -3.67074,0 -5.47787,-2.03302 -6.38144,-4.06605 -0.50826,-1.18593 -0.8471,-2.54128 -0.90357,-4.06605 v -15.53007 c 0.16942,-2.99307 1.07299,-5.19551 3.04954,-6.8897 0.96004,-0.8471 2.37187,-1.24241 4.23547,-1.24241 3.67075,0 5.53435,2.03303 6.43792,4.00958 0.50826,1.18594 0.8471,2.48481 0.90357,3.95311 z m -5.36493,-15.69948 c 0.0565,-1.18593 -0.16942,-2.03303 -0.73415,-2.7107 -0.28237,-0.28237 -0.73415,-0.45179 -1.24241,-0.45179 -1.07298,0 -1.52477,0.73415 -1.75066,1.58125 -0.16942,0.45178 -0.22589,0.96004 -0.16942,1.58124 v 15.53007 c -0.0565,1.18593 0.22589,2.03302 0.73415,2.65423 0.28237,0.28236 0.67768,0.45178 1.18593,0.45178 1.07299,0 1.58125,-0.67768 1.80714,-1.52477 0.16942,-0.45178 0.22589,-0.96004 0.16942,-1.58124 z"
           style="font-size:56.47296906px;fill:#ff00ff"
           id="path5349" />
        <path
           d="m 307.44589,280.83577 c -0.16942,2.99307 -1.07299,5.08257 -3.04954,6.72029 -1.01652,0.84709 -2.42834,1.2424 -4.29195,1.2424 -3.67074,0 -5.47788,-2.03302 -6.38144,-4.06605 -0.50826,-1.18593 -0.8471,-2.54128 -0.90357,-4.06605 v -15.53007 c 0.16942,-2.99307 1.07298,-5.19551 3.04954,-6.8897 0.96004,-0.8471 2.37186,-1.24241 4.23547,-1.24241 3.67074,0 5.53435,2.03303 6.43792,4.00958 0.50826,1.18594 0.84709,2.48481 0.90357,3.95311 z m -5.36494,-15.69948 c 0.0565,-1.18593 -0.16941,-2.03303 -0.73414,-2.7107 -0.28237,-0.28237 -0.73415,-0.45179 -1.24241,-0.45179 -1.07299,0 -1.52477,0.73415 -1.75066,1.58125 -0.16942,0.45178 -0.22589,0.96004 -0.16942,1.58124 v 15.53007 c -0.0565,1.18593 0.22589,2.03302 0.73415,2.65423 0.28236,0.28236 0.67767,0.45178 1.18593,0.45178 1.07299,0 1.58124,-0.67768 1.80714,-1.52477 0.16941,-0.45178 0.22589,-0.96004 0.16941,-1.58124 z"
           style="font-size:56.47296906px;fill:#ff00ff"
           id="path5351" />
        <path
           d="m 317.97545,249.83211 v 7.62386 h 3.89663 v 5.13904 h -3.89663 v 15.36064 c 0,0.96004 0,2.20245 0.22589,3.21896 0.22589,1.01652 0.67768,1.86361 1.58124,1.86361 0.45179,0 1.01652,-0.0565 1.41183,-0.11295 0.22589,-0.0565 0.45178,-0.0565 0.67767,-0.11294 v 5.59082 c -0.28236,0.0565 -0.56473,0.16942 -0.84709,0.22589 -0.56473,0.11295 -1.29888,0.16942 -2.20245,0.16942 -3.3319,0 -4.91314,-1.69419 -5.70377,-3.84016 -0.79062,-2.14597 -0.84709,-4.74373 -0.84709,-6.55086 v -15.81243 h -2.88012 v -5.13904 h 2.88012 v -7.62386 z"
           style="font-size:56.47296906px;fill:#ff00ff"
           id="path5353" />
        <path
           d="m 333.51346,265.36218 c 0,-0.73415 0,-1.63771 -0.22589,-2.37186 -0.28237,-0.67768 -0.73415,-1.24241 -1.63772,-1.24241 -0.73415,0 -1.18593,0.56473 -1.41183,1.24241 -0.28236,0.67767 -0.33883,1.63771 -0.33883,2.37186 0,0.96004 0.50825,1.97656 1.2424,2.88012 0.67768,0.90357 1.58125,1.80714 2.48481,2.65423 1.18594,1.18593 2.59776,2.54129 3.5578,4.06606 0.96004,1.58124 1.69419,3.3319 1.69419,5.36493 0,1.97655 -0.45178,4.06605 -1.58124,5.64729 -1.18594,1.63772 -2.99307,2.82365 -5.70377,2.82365 -3.44486,0 -5.47788,-1.58124 -6.60734,-3.50132 -1.12946,-1.92008 -1.35535,-4.29195 -1.35535,-5.92966 h 5.30846 c 0,0.84709 0.0565,2.03302 0.45178,2.93659 0.39531,0.96004 1.01651,1.75066 2.20245,1.75066 1.63771,0 1.97655,-1.92008 1.97655,-3.72721 0,-1.86361 -1.80714,-3.72722 -3.5578,-5.47788 -1.35535,-1.29888 -2.65423,-2.48481 -3.67074,-4.00958 -1.01651,-1.52477 -1.75066,-3.21896 -1.75066,-5.47788 0,-1.80713 0.33884,-3.89663 1.41182,-5.53435 1.07299,-1.58124 2.82365,-2.76718 5.53435,-2.82365 3.33191,-0.0565 5.19552,1.18593 6.15556,2.82365 0.96004,1.63772 1.12946,3.78369 1.12946,5.53435 z"
           style="font-size:56.47296906px;fill:#ff00ff"
           id="path5355" />
        <path
           d="m 348.6385,249.83211 v 7.62386 h 3.89664 v 5.13904 h -3.89664 v 15.36064 c 0,0.96004 0,2.20245 0.2259,3.21896 0.22589,1.01652 0.67767,1.86361 1.58124,1.86361 0.45178,0 1.01651,-0.0565 1.41182,-0.11295 0.2259,-0.0565 0.45179,-0.0565 0.67768,-0.11294 v 5.59082 c -0.28237,0.0565 -0.56473,0.16942 -0.8471,0.22589 -0.56472,0.11295 -1.29887,0.16942 -2.20244,0.16942 -3.33191,0 -4.91315,-1.69419 -5.70377,-3.84016 -0.79062,-2.14597 -0.8471,-4.74373 -0.8471,-6.55086 v -15.81243 h -2.88012 v -5.13904 h 2.88012 v -7.62386 z"
           style="font-size:56.47296906px;fill:#ff00ff"
           id="path5357" />
        <path
           d="m 366.9437,263.32915 c -0.50826,-0.16941 -1.07299,-0.22589 -1.58125,-0.22589 -0.90357,0 -1.97655,0.11295 -2.88012,0.96004 -1.07299,0.90357 -1.2424,1.86361 -1.2424,2.82365 v 21.45973 h -5.70377 v -30.89071 h 5.70377 v 3.44485 c 0.0565,-0.39531 0.45178,-1.35535 1.35535,-2.25892 0.90356,-0.8471 2.25892,-1.63772 4.34842,-1.63772 z"
           style="font-size:56.47296906px;fill:#ff00ff"
           id="path5359" />
        <path
           d="m 377.63296,264.79745 c 0,-0.50826 0,-1.29888 -0.16942,-1.86361 -0.22589,-0.56473 -0.67767,-0.96004 -1.41182,-0.96004 -0.96004,0 -1.35535,0.73415 -1.52477,1.63772 -0.0565,0.45178 -0.11295,0.96004 -0.11295,1.4683 0,0.50825 0,1.01651 0,1.46829 h -5.70377 v -1.29887 c 0,-2.25892 0.8471,-4.29195 2.20245,-5.81672 1.35535,-1.52477 3.27543,-2.42834 5.47788,-2.42834 1.86361,0 3.5578,0.73415 4.85667,1.97656 1.29888,1.2424 2.0895,2.99306 2.0895,5.02609 v 18.97492 c 0,2.76717 0.16942,4.00958 0.39531,5.36493 h -5.59082 c -0.50826,-0.6212 -0.50826,-2.0895 -0.50826,-2.48481 h -0.39531 c -0.28236,0.50826 -0.79062,1.2424 -1.58124,1.86361 -0.79062,0.6212 -1.86361,1.07298 -2.99307,1.07298 -0.73415,0 -1.92008,-0.28236 -2.82365,-1.41182 -0.96004,-1.07299 -1.75066,-2.99307 -1.75066,-6.21203 0,-3.44485 1.01652,-5.92966 2.37187,-7.62385 1.35535,-1.69419 3.04954,-2.76717 4.46136,-3.50132 1.41183,-0.73415 2.48481,-1.24241 2.7107,-1.86361 z m 0,8.64037 c -2.76717,1.18593 -3.9531,3.9531 -3.9531,6.8897 0,0.39531 0.0565,1.07298 0.28236,1.69419 0.22589,0.67767 0.6212,1.18593 1.29888,1.18593 1.29888,0 2.37186,-0.79062 2.37186,-1.86361 z"
           style="font-size:56.47296906px;fill:#ff00ff"
           id="path5361" />
        <path
           d="m 386.97131,257.45597 h 5.70377 v 2.03302 c 0.96004,-0.90357 1.80713,-1.58124 2.93659,-2.0895 0.50826,-0.28236 1.07299,-0.39531 1.58124,-0.39531 1.58125,0 2.65423,0.90357 3.38838,2.03303 0.67768,1.18593 1.01651,2.7107 1.01651,4.00958 v 19.70907 c 0,1.29887 -0.33883,2.82364 -1.01651,3.9531 -0.73415,1.18594 -1.80713,2.0895 -3.38838,2.0895 -1.07298,0 -2.20244,-0.6212 -3.04954,-1.2424 -0.50825,-0.39531 -0.96004,-0.79062 -1.46829,-1.24241 v 12.64995 h -5.70377 z m 5.70377,24.11395 c 0,0.90357 0.84709,1.86361 1.69418,1.86361 0.8471,0 1.52477,-0.79062 1.52477,-1.86361 v -17.3372 c 0,-1.07298 -0.67767,-1.86361 -1.52477,-1.86361 -0.84709,0 -1.69418,0.79063 -1.69418,1.86361 z"
           style="font-size:56.47296906px;fill:#ff00ff"
           id="path5363" />
        <path
           d="m 405.94268,257.45597 h 5.70377 v 2.03302 c 0.96004,-0.90357 1.80714,-1.58124 2.93659,-2.0895 0.50826,-0.28236 1.07299,-0.39531 1.58125,-0.39531 1.58124,0 2.65423,0.90357 3.38838,2.03303 0.67767,1.18593 1.01651,2.7107 1.01651,4.00958 v 19.70907 c 0,1.29887 -0.33884,2.82364 -1.01651,3.9531 -0.73415,1.18594 -1.80714,2.0895 -3.38838,2.0895 -1.07299,0 -2.20245,-0.6212 -3.04954,-1.2424 -0.50826,-0.39531 -0.96004,-0.79062 -1.4683,-1.24241 v 12.64995 h -5.70377 z m 5.70377,24.11395 c 0,0.90357 0.84709,1.86361 1.69419,1.86361 0.84709,0 1.52477,-0.79062 1.52477,-1.86361 v -17.3372 c 0,-1.07298 -0.67768,-1.86361 -1.52477,-1.86361 -0.8471,0 -1.69419,0.79063 -1.69419,1.86361 z"
           style="font-size:56.47296906px;fill:#ff00ff"
           id="path5365" />
        <path
           d="m 433.22355,264.79745 c 0,-0.50826 0,-1.29888 -0.16942,-1.86361 -0.22589,-0.56473 -0.67768,-0.96004 -1.41183,-0.96004 -0.96004,0 -1.35535,0.73415 -1.52477,1.63772 -0.0565,0.45178 -0.11294,0.96004 -0.11294,1.4683 0,0.50825 0,1.01651 0,1.46829 h -5.70377 v -1.29887 c 0,-2.25892 0.84709,-4.29195 2.20244,-5.81672 1.35536,-1.52477 3.27544,-2.42834 5.47788,-2.42834 1.86361,0 3.5578,0.73415 4.85668,1.97656 1.29888,1.2424 2.0895,2.99306 2.0895,5.02609 v 18.97492 c 0,2.76717 0.16942,4.00958 0.39531,5.36493 h -5.59083 c -0.50825,-0.6212 -0.50825,-2.0895 -0.50825,-2.48481 h -0.39531 c -0.28237,0.50826 -0.79062,1.2424 -1.58125,1.86361 -0.79062,0.6212 -1.8636,1.07298 -2.99306,1.07298 -0.73415,0 -1.92008,-0.28236 -2.82365,-1.41182 -0.96004,-1.07299 -1.75066,-2.99307 -1.75066,-6.21203 0,-3.44485 1.01651,-5.92966 2.37186,-7.62385 1.35535,-1.69419 3.04954,-2.76717 4.46137,-3.50132 1.41182,-0.73415 2.48481,-1.24241 2.7107,-1.86361 z m 0,8.64037 c -2.76718,1.18593 -3.95311,3.9531 -3.95311,6.8897 0,0.39531 0.0565,1.07298 0.28236,1.69419 0.2259,0.67767 0.62121,1.18593 1.29888,1.18593 1.29888,0 2.37187,-0.79062 2.37187,-1.86361 z"
           style="font-size:56.47296906px;fill:#ff00ff"
           id="path5367" />
        <path
           d="m 442.78248,246.83905 h 5.70377 v 12.64994 c 0.96004,-0.90357 1.80713,-1.58124 2.93659,-2.0895 0.50826,-0.28236 1.07299,-0.39531 1.58125,-0.39531 1.58124,0 2.65423,0.90357 3.38837,2.03303 0.67768,1.18593 1.01652,2.7107 1.01652,4.00958 v 19.70907 c 0,1.29887 -0.33884,2.82364 -1.01652,3.9531 -0.73414,1.18594 -1.80713,2.0895 -3.38837,2.0895 -1.07299,0 -2.20245,-0.6212 -3.04954,-1.2424 -0.50826,-0.39531 -0.96005,-0.79062 -1.4683,-1.24241 v 2.03303 h -5.70377 z m 5.70377,34.73087 c 0,1.07299 0.84709,1.86361 1.69419,1.86361 0.84709,0 1.52477,-0.79062 1.52477,-1.86361 v -17.3372 c 0,-1.07298 -0.67768,-1.86361 -1.52477,-1.86361 -0.8471,0 -1.69419,0.96004 -1.69419,1.86361 z"
           style="font-size:56.47296906px;fill:#ff00ff"
           id="path5369" />
        <path
           d="m 461.75387,288.34668 v -41.50763 h 5.70377 v 41.50763 z"
           style="font-size:56.47296906px;fill:#ff00ff"
           id="path5371" />
        <path
           d="m 486.18901,277.27798 v 3.55779 c -0.16942,2.99307 -1.07299,5.08257 -3.10602,6.72029 -1.01651,0.84709 -2.42834,1.2424 -4.29194,1.2424 -3.67075,0 -5.53435,-2.03302 -6.43792,-4.06605 -0.50826,-1.18593 -0.8471,-2.54128 -0.90357,-4.06605 v -15.53007 c 0.16942,-2.99307 1.12946,-5.19551 3.16249,-6.8897 0.96004,-0.8471 2.37186,-1.24241 4.23547,-1.24241 3.67074,0 5.53435,2.03303 6.43792,4.00958 0.50825,1.18594 0.84709,2.48481 0.90357,3.95311 v 8.9792 h -9.43099 v 6.72029 c 0.0565,1.18593 0.39531,2.03302 0.90357,2.65423 0.28236,0.28236 0.67767,0.45178 1.18593,0.45178 1.07299,0 1.58124,-0.67768 1.80713,-1.52477 0.16942,-0.45178 0.2259,-0.96004 0.2259,-1.58124 v -3.38838 z m -9.43099,-7.79327 h 4.12253 v -4.34842 c 0,-1.18593 -0.2259,-2.03303 -0.79063,-2.7107 -0.28236,-0.28237 -0.73414,-0.45179 -1.2424,-0.45179 -1.07299,0 -1.52477,0.73415 -1.80714,1.58125 -0.16941,0.45178 -0.22589,0.96004 -0.28236,1.58124 z"
           style="font-size:56.47296906px;fill:#ff00ff"
           id="path5373" />
        <path
           d="m 498.81425,288.34668 v -41.50763 h 5.36493 c 3.61427,0 6.43792,0.67767 8.30153,2.42834 1.8636,1.75066 2.82364,4.46136 2.82364,8.58389 0,1.97655 -0.16941,3.44485 -0.79062,4.8002 -0.6212,1.35535 -1.58124,2.48481 -2.99306,3.78369 1.52477,0.84709 2.65422,2.42834 3.55779,5.08256 0.45179,1.29888 0.67768,2.99307 0.67768,5.08257 0,3.10602 -0.56473,5.87319 -1.97656,8.01916 -1.41182,2.14598 -3.84016,3.5578 -7.45443,3.72722 z m 6.09908,-24.39632 c 0.50825,0 1.69419,0.0565 2.7107,-0.62121 1.01651,-0.67767 1.80714,-2.03302 1.80714,-4.91314 0,-2.88013 -0.79063,-4.23548 -1.80714,-4.91315 -1.01651,-0.67768 -2.20245,-0.6212 -2.7107,-0.6212 z m 0,18.35371 c 0.50825,0 1.69419,0.11295 2.7107,-0.6212 1.01651,-0.73415 1.80714,-2.37187 1.80714,-5.76024 0,-3.38838 -0.79063,-5.0261 -1.80714,-5.76025 -1.01651,-0.73414 -2.20245,-0.6212 -2.7107,-0.6212 z"
           style="font-style:normal;font-variant:normal;font-weight:normal;font-stretch:normal;font-size:56.47296906px;line-height:1.25;font-family:'League Gothic';-inkscape-font-specification:'League Gothic'"
           id="path5375" />
        <path
           d="m 528.13961,257.45597 h 5.70377 v 30.89071 h -5.70377 v -2.59776 c -0.11295,0.0565 -0.33884,0.28237 -0.6212,0.56473 -0.67768,0.67768 -1.4683,1.4683 -2.48481,2.03303 -0.50826,0.28236 -1.01652,0.45178 -1.52477,0.45178 -1.52477,0 -2.59776,-0.90356 -3.27544,-2.0895 -0.67767,-1.12946 -1.01651,-2.65423 -1.01651,-3.9531 v -25.29989 h 5.70377 v 24.45279 c 0,1.18593 0.67768,1.35535 1.35535,1.35535 0.6212,0 0.96004,-0.33884 1.35535,-0.73415 0.16942,-0.16942 0.33884,-0.45178 0.50826,-0.73414 z"
           style="font-style:normal;font-variant:normal;font-weight:normal;font-stretch:normal;font-size:56.47296906px;line-height:1.25;font-family:'League Gothic';-inkscape-font-specification:'League Gothic'"
           id="path5377" />
        <path
           d="m 538.41152,246.83905 h 5.70377 v 5.70377 h -5.70377 z m 0,41.50763 v -30.89071 h 5.70377 v 30.89071 z"
           style="font-style:normal;font-variant:normal;font-weight:normal;font-stretch:normal;font-size:56.47296906px;line-height:1.25;font-family:'League Gothic';-inkscape-font-specification:'League Gothic'"
           id="path5379" />
        <path
           d="m 548.6693,288.34668 v -41.50763 h 5.70377 v 41.50763 z"
           style="font-style:normal;font-variant:normal;font-weight:normal;font-stretch:normal;font-size:56.47296906px;line-height:1.25;font-family:'League Gothic';-inkscape-font-specification:'League Gothic'"
           id="path5381" />
        <path
           d="m 573.32769,288.34668 h -5.70377 v -2.03303 c -0.96004,0.90357 -1.80713,1.58125 -2.88012,2.0895 -0.56473,0.28237 -1.12946,0.39531 -1.63771,0.39531 -1.58125,0 -2.65423,-0.90356 -3.33191,-2.0895 -0.73415,-1.12946 -1.07299,-2.65423 -1.07299,-3.9531 v -19.70907 c 0,-1.29888 0.33884,-2.82365 1.07299,-4.00958 0.67768,-1.12946 1.75066,-2.03303 3.33191,-2.03303 1.07298,0 2.20244,0.6212 3.04954,1.24241 0.50825,0.39531 0.96004,0.79062 1.46829,1.2424 v -12.64994 h 5.70377 z m -5.70377,-24.11396 c 0,-0.90357 -0.84709,-1.86361 -1.69419,-1.86361 -0.84709,0 -1.52477,0.79063 -1.52477,1.86361 v 17.3372 c 0,1.07299 0.67768,1.86361 1.52477,1.86361 0.8471,0 1.69419,-0.79062 1.69419,-1.86361 z"
           style="font-style:normal;font-variant:normal;font-weight:normal;font-stretch:normal;font-size:56.47296906px;line-height:1.25;font-family:'League Gothic';-inkscape-font-specification:'League Gothic'"
           id="path5383" />
        <path
           d="m 586.53882,265.36218 c 0,-0.73415 0,-1.63771 -0.22589,-2.37186 -0.28236,-0.67768 -0.73415,-1.24241 -1.63771,-1.24241 -0.73415,0 -1.18594,0.56473 -1.41183,1.24241 -0.28236,0.67767 -0.33884,1.63771 -0.33884,2.37186 0,0.96004 0.50826,1.97656 1.24241,2.88012 0.67768,0.90357 1.58124,1.80714 2.48481,2.65423 1.18593,1.18593 2.59776,2.54129 3.5578,4.06606 0.96004,1.58124 1.69419,3.3319 1.69419,5.36493 0,1.97655 -0.45179,4.06605 -1.58125,5.64729 -1.18593,1.63772 -2.99306,2.82365 -5.70377,2.82365 -3.44485,0 -5.47787,-1.58124 -6.60733,-3.50132 -1.12946,-1.92008 -1.35535,-4.29195 -1.35535,-5.92966 h 5.30845 c 0,0.84709 0.0565,2.03302 0.45179,2.93659 0.39531,0.96004 1.01651,1.75066 2.20244,1.75066 1.63772,0 1.97656,-1.92008 1.97656,-3.72721 0,-1.86361 -1.80714,-3.72722 -3.5578,-5.47788 -1.35535,-1.29888 -2.65423,-2.48481 -3.67074,-4.00958 -1.01652,-1.52477 -1.75066,-3.21896 -1.75066,-5.47788 0,-1.80713 0.33883,-3.89663 1.41182,-5.53435 1.07299,-1.58124 2.82365,-2.76718 5.53435,-2.82365 3.33191,-0.0565 5.19551,1.18593 6.15555,2.82365 0.96004,1.63772 1.12946,3.78369 1.12946,5.53435 z"
           style="font-style:normal;font-variant:normal;font-weight:normal;font-stretch:normal;font-size:56.47296906px;line-height:1.25;font-family:'League Gothic';-inkscape-font-specification:'League Gothic'"
           id="path5385" />
      </g>
      <circle
         r="4.4642859"
         cy="273.54895"
         cx="648.43512"
         id="path4516"
         style="color:#000000;clip-rule:nonzero;display:inline;overflow:visible;visibility:visible;opacity:1;isolation:auto;mix-blend-mode:normal;color-interpolation:sRGB;color-interpolation-filters:linearRGB;solid-color:#000000;solid-opacity:1;fill:#000000;fill-opacity:1;fill-rule:nonzero;stroke:none;stroke-width:0.55900002;stroke-linecap:butt;stroke-linejoin:miter;stroke-miterlimit:4;stroke-dasharray:none;stroke-dashoffset:0;stroke-opacity:1;color-rendering:auto;image-rendering:auto;shape-rendering:auto;text-rendering:auto;enable-background:accumulate" />
    </g>
  </g>
</svg>
