<?xml version="1.0" encoding="UTF-8" standalone="no"?>
<!-- Created with Inkscape (http://www.inkscape.org/) -->

<svg
   inkscape:export-ydpi="96"
   inkscape:export-xdpi="96"
   inkscape:export-filename="./home-page.pdf"
   sodipodi:docname="reproducible-outputs-container.svg"
   inkscape:version="1.2.1 (9c6d41e410, 2022-07-14)"
   version="1.1"
   id="svg2"
   height="305"
   width="305"
   xmlns:inkscape="http://www.inkscape.org/namespaces/inkscape"
   xmlns:sodipodi="http://sodipodi.sourceforge.net/DTD/sodipodi-0.dtd"
   xmlns:xlink="http://www.w3.org/1999/xlink"
   xmlns="http://www.w3.org/2000/svg"
   xmlns:svg="http://www.w3.org/2000/svg"
   xmlns:rdf="http://www.w3.org/1999/02/22-rdf-syntax-ns#"
   xmlns:cc="http://creativecommons.org/ns#"
   xmlns:dc="http://purl.org/dc/elements/1.1/">
  <title
     id="title3542">Guix Reproducible Outputs · Container</title>
  <defs
     id="defs4">
    <linearGradient
       inkscape:collect="always"
       id="linearGradient31331">
      <stop
         style="stop-color:#00ffff;stop-opacity:1;"
         offset="0"
         id="stop31327" />
      <stop
         style="stop-color:#00ffff;stop-opacity:0;"
         offset="1"
         id="stop31329" />
    </linearGradient>
    <radialGradient
       inkscape:collect="always"
       xlink:href="#linearGradient31331"
       id="radialGradient14678"
       gradientUnits="userSpaceOnUse"
       gradientTransform="matrix(0.21893943,0,0,0.27687633,299.04807,1423.1913)"
       cx="837.04724"
       cy="467.72104"
       fx="837.04724"
       fy="467.72104"
       r="623.64777" />
    <linearGradient
       inkscape:collect="always"
       xlink:href="#linearGradient12551"
       id="linearGradient12553"
       x1="329.91824"
       y1="1685.0189"
       x2="329.91824"
       y2="1380.0189"
       gradientUnits="userSpaceOnUse"
       gradientTransform="translate(-329.91824,-1380.0189)" />
    <linearGradient
       inkscape:collect="always"
       id="linearGradient12551">
      <stop
         style="stop-color:#1a1a1a;stop-opacity:1;"
         offset="0"
         id="stop12547" />
      <stop
         style="stop-color:#1a1a1a;stop-opacity:0;"
         offset="1"
         id="stop12549" />
    </linearGradient>
  </defs>
  <sodipodi:namedview
     id="base"
     pagecolor="#323232"
     bordercolor="#ffcc00"
     borderopacity="1"
     inkscape:pageopacity="0"
     inkscape:pageshadow="2"
     inkscape:zoom="2"
     inkscape:cx="147"
     inkscape:cy="142"
     inkscape:document-units="px"
     inkscape:current-layer="layer11"
     showgrid="false"
     inkscape:showpageshadow="false"
     inkscape:window-width="1920"
     inkscape:window-height="1011"
     inkscape:window-x="0"
     inkscape:window-y="32"
     inkscape:window-maximized="1"
     borderlayer="true"
     inkscape:snap-bbox="true"
     inkscape:bbox-nodes="true"
     inkscape:snap-global="true"
     fit-margin-top="0"
     fit-margin-left="0"
     fit-margin-right="0"
     fit-margin-bottom="0"
     showguides="true"
     inkscape:guide-bbox="true"
     inkscape:snap-page="true"
     inkscape:bbox-paths="true"
     inkscape:pagecheckerboard="0"
     inkscape:deskcolor="#323232">
    <inkscape:grid
       type="axonomgrid"
       id="grid14846"
       spacingy="15.11811"
       originx="-307.24108"
       originy="-1380.0189" />
  </sodipodi:namedview>
  <metadata
     id="metadata7">
    <rdf:RDF>
      <cc:Work
         rdf:about="">
        <dc:format>image/svg+xml</dc:format>
        <dc:type
           rdf:resource="http://purl.org/dc/dcmitype/StillImage" />
        <dc:title>Guix Reproducible Outputs · Container</dc:title>
        <cc:license
           rdf:resource="http://creativecommons.org/licenses/by-sa/4.0/" />
        <dc:date>2023-09-21</dc:date>
        <dc:creator>
          <cc:Agent>
            <dc:title>Luis Felipe López Acevedo</dc:title>
          </cc:Agent>
        </dc:creator>
        <dc:language>en</dc:language>
      </cc:Work>
      <cc:License
         rdf:about="http://creativecommons.org/licenses/by-sa/4.0/">
        <cc:permits
           rdf:resource="http://creativecommons.org/ns#Reproduction" />
        <cc:permits
           rdf:resource="http://creativecommons.org/ns#Distribution" />
        <cc:requires
           rdf:resource="http://creativecommons.org/ns#Notice" />
        <cc:requires
           rdf:resource="http://creativecommons.org/ns#Attribution" />
        <cc:permits
           rdf:resource="http://creativecommons.org/ns#DerivativeWorks" />
        <cc:requires
           rdf:resource="http://creativecommons.org/ns#ShareAlike" />
      </cc:License>
    </rdf:RDF>
  </metadata>
  <g
     inkscape:groupmode="layer"
     id="layer1"
     inkscape:label="background"
     sodipodi:insensitive="true"
     style="display:none">
    <rect
       style="display:inline;fill:url(#linearGradient12553);fill-opacity:1;stroke-width:3"
       id="rect11991"
       width="305"
       height="304.99997"
       x="3.4082032e-06"
       y="2.0898438e-05" />
  </g>
  <g
     inkscape:groupmode="layer"
     id="layer11"
     inkscape:label="output"
     style="display:inline"
     transform="translate(-329.91824,-1380.0189)">
    <path
       id="path13818"
       style="opacity:0.5;fill:url(#radialGradient14678);fill-opacity:1;stroke:none;stroke-width:1.88977;stroke-linecap:round;stroke-dasharray:1, 2"
       d="m 13.21694,1122.2514 -10.7988,6.2344 v 1.1562 l 12.8008,-7.3906 z m 21.3535,0 54.7873,31.6326 -64.4629,37.2168 -22.4766,-12.9766 v 1.1543 l 21.4766,12.3984 -21.4766,12.4004 v 1.1543 l 22.4766,-12.9765 64.4648,37.2187 -64.4629,37.2188 -22.4785,-12.9785 v 1.1562 l 21.4766,12.4004 -21.4766,12.3984 v 1.1543 l 22.4766,-12.9765 64.4629,37.2168 -64.4649,37.2187 -22.4746,-12.9746 v 1.1523 l 21.4766,12.3985 -21.4766,12.4004 v 1.1543 l 22.4766,-12.9766 64.4629,37.2188 -64.4629,37.2168 -22.4766,-12.9766 v 1.1543 l 21.4766,12.4004 -21.4766,12.3984 v 1.1563 l 22.4766,-12.9766 64.4629,37.2168 -64.4629,37.2188 -22.4766,-12.9766 v 1.1543 l 21.4766,12.3984 -21.4766,12.4004 v 1.1543 l 22.4766,-12.9765 64.4629,37.2168 -64.4629,37.2187 -22.4766,-12.9766 v 1.1563 l 21.4747,12.3984 -21.4747,12.3985 v 1.1562 l 22.4766,-12.9765 64.4629,37.2168 -64.4649,37.2187 -22.4746,-12.9766 v 1.1543 l 21.4766,12.3985 -21.4766,12.3984 v 1.1543 l 22.4747,-12.9766 64.4648,37.2188 -64.4629,37.2168 -22.4766,-12.9766 v 1.1563 l 21.4746,12.3984 -21.4746,12.3985 v 1.1562 l 22.4766,-12.9766 64.4629,37.2188 -64.4629,37.2168 -22.4766,-12.9766 v 1.1543 l 21.4766,12.4004 -21.4766,12.3984 v 1.1543 l 22.4766,-12.9765 64.4629,37.2187 -64.4649,37.2168 -22.4746,-12.9746 v 1.1543 l 21.4746,12.3985 -21.4746,12.3984 v 1.1562 l 22.4747,-12.9765 64.4648,37.2187 -64.4648,37.2168 -22.4746,-12.9746 v 1.1523 l 21.4765,12.4004 -21.4765,12.4004 -1e-4,1.1524 22.4747,-12.9766 64.4628,37.2168 -30.957,17.873 h 2.004 l 29.955,-17.2949 29.9551,17.295 1.9961,-10e-5 -30.9532,-17.871 64.4649,-37.2188 64.4629,37.2188 -30.9531,17.8711 h 2 l 29.9531,-17.293 29.9531,17.293 h 2.002 l -30.9532,-17.8711 64.4629,-37.2188 64.4629,37.2168 -30.957,17.8731 h 2.0019 l 29.9551,-17.295 29.9551,17.295 h 1.998 l -30.9531,-17.8711 64.4629,-37.2188 64.4629,37.2188 -30.9532,17.871 1.9981,10e-5 29.9551,-17.2949 29.9551,17.2949 2.0038,-10e-5 -30.957,-17.873 64.461,-37.2168 64.4648,37.2188 -30.955,17.8711 h 2.0019 l 29.9531,-17.293 29.9532,17.293 h 1.9999 l -30.9531,-17.8711 64.4649,-37.2188 64.4629,37.2188 -30.9532,17.8711 h 1.9981 l 29.9551,-17.2949 29.955,17.2949 2.0019,-10e-5 -30.957,-17.873 64.4629,-37.2168 95.418,55.0898 1.998,10e-5 -96.4159,-55.666 64.4628,-37.2188 86.5,49.9414 v -1.1562 l -85.4999,-49.3633 64.4628,-37.2168 21.0371,12.1465 10e-5,-1.1563 -20.0372,-11.5684 20.0371,-11.5683 10e-5,-1.1543 -21.0372,12.1465 -64.4629,-37.2188 64.463,-37.2167 21.037,12.1445 v -1.1562 l -20.0352,-11.5664 20.0352,-11.5684 v -1.1562 l -21.0371,12.1464 -64.463,-37.2187 64.463,-37.2168 21.0371,12.1446 -10e-5,-1.1543 -20.0371,-11.5683 20.0372,-11.5684 -10e-5,-1.1523 -21.0371,12.1445 -64.4629,-37.2188 64.4629,-37.2168 21.0371,12.1465 v -1.1562 l -20.0371,-11.5684 20.0372,-11.5683 -10e-5,-1.1563 -21.0371,12.1465 -64.4629,-37.2168 64.4629,-37.2188 21.0371,12.1447 v -1.1524 l -20.0371,-11.5683 20.0371,-11.5684 v -1.1543 l -21.0371,12.1445 -64.4629,-37.2168 64.4629,-37.2187 21.0371,12.1464 v -1.1562 l -20.0371,-11.5683 20.0371,-11.5684 v -1.1543 l -21.0371,12.1445 -64.4629,-37.2168 64.4629,-37.2168 21.037,12.1446 10e-5,-1.1542 -20.0371,-11.5684 20.037,-11.5684 10e-5,-1.1543 -21.0371,12.1446 -64.4629,-37.2168 64.4629,-37.2188 21.0371,12.1465 v -1.1543 l -20.0372,-11.5684 20.0372,-11.5683 v -1.1563 l -21.0391,12.1465 -64.4628,-37.2168 64.4648,-37.2207 21.0371,12.1465 v -1.1543 l -20.0372,-11.5684 20.0372,-11.5683 -10e-5,-1.1543 -21.0371,12.1465 -64.4629,-37.2188 64.4629,-37.2168 21.0372,12.1445 -10e-5,-1.1543 -20.037,-11.5683 20.0371,-11.5684 v -1.1562 l -21.0372,12.1464 -64.4628,-37.2187 54.7871,-31.6309 h -1.9981 l -53.789,31.0547 -53.7871,-31.0547 h -2.002 l 54.7871,31.6329 -64.4609,37.2168 -64.4629,-37.2168 54.7871,-31.6328 h -2.002 l -53.7871,31.0547 -53.7871,-31.0547 h -2 l 54.7891,31.6308 -64.4668,37.2188 -64.4629,-37.2168 54.7891,-31.6328 h -2 l -53.7891,31.0547 -53.7871,-31.0547 h -1.9981 l 54.7871,31.6328 -64.4629,37.2168 -64.4629,-37.2168 54.7871,-31.6328 h -2.0019 l -53.7852,31.0547 -53.7871,-31.0547 h -2.0019 l 54.7872,31.6326 -64.4629,37.2168 -64.4629,-37.2168 54.7872,-31.6328 h -2 l -53.7872,31.0547 -53.7871,-31.0547 h -2.0019 l 54.7872,31.6326 -64.4629,37.2167 -64.4609,-37.2167 54.7871,-31.6329 h -1.998 l -53.7891,31.0547 -53.7891,-31.0547 h -2 l 54.7891,31.6329 -64.4629,37.2168 -64.4648,-37.2188 54.7871,-31.6309 h -2 l -53.7871,31.0547 -53.7871,-31.0547 z m 55.7853,32.2088 64.4649,37.2187 -64.461,37.2188 -64.4668,-37.2207 z m 130.9297,0 64.4629,37.2168 -64.4648,37.2187 -64.461,-37.2168 z m 392.7773,0 64.4649,37.2187 -64.4629,37.2168 -64.4629,-37.2187 z m 130.9297,0 64.4629,37.2168 -64.4648,37.2207 -64.4629,-37.2188 z m 130.9239,0 64.4629,37.2188 -64.461,37.2168 -64.4648,-37.2188 z m -523.7051,0 64.4629,37.2168 -64.4629,37.2168 -64.4629,-37.2168 z m 130.9277,0 64.4609,37.2168 -64.4628,37.2168 -64.461,-37.2168 z m -196.3906,37.793 64.4629,37.2187 -64.4629,37.2168 -64.4629,-37.2168 z m 261.8515,0 64.4629,37.2187 -64.4628,37.2168 -64.4629,-37.2168 z m 261.8555,0 64.4629,37.2167 -64.4648,37.2208 -64.4649,-37.2188 z m -654.6348,0 64.4629,37.2168 -64.4629,37.2168 -64.4628,-37.2168 z m 261.8536,0 64.4629,37.2167 -64.4629,37.2188 -64.4629,-37.2188 z m 261.8535,0 64.4629,37.2168 -64.4629,37.2168 -64.4629,-37.2168 z m -589.168,37.7929 64.4609,37.2189 -64.4629,37.2168 -64.4629,-37.2168 z m 654.6309,0 64.4629,37.2188 -64.4629,37.2168 -64.4629,-37.2168 z m 130.9277,0 64.4649,37.2188 -64.4649,37.2188 -64.4648,-37.2169 z m -654.6348,0 64.4629,37.2168 -64.4629,37.2188 -64.4609,-37.2189 z m 130.9297,0 64.4629,37.2168 -64.4648,37.2188 -64.4629,-37.2188 z m 130.9239,0 64.4628,37.2168 -64.4628,37.2188 -64.4629,-37.2188 z m 130.9277,0 64.4629,37.2168 -64.4629,37.2188 -64.4629,-37.2188 z m -196.3907,37.7932 64.4628,37.2187 -64.4628,37.2188 -64.4629,-37.2188 z m -261.8516,0 64.4629,37.2168 -64.4649,37.2187 -64.4609,-37.2188 z m 130.9258,0 64.4629,37.2187 -64.4629,37.2168 -64.4629,-37.2168 z m 261.8515,0 64.4629,37.2187 -64.4609,37.2168 -64.4629,-37.2168 z m 130.9258,0 64.465,37.2166 -64.4629,37.2187 -64.4648,-37.2187 z m 130.9297,0 64.4629,37.2187 -64.4629,37.2168 -64.4629,-37.2187 z m -720.0977,37.7949 64.4629,37.2188 -64.4628,37.2168 -64.4629,-37.2168 z m 130.9278,0 64.4629,37.2168 -64.4629,37.2188 -64.4629,-37.2168 z m 130.9238,0 64.4649,37.2188 -64.4629,37.2168 -64.4649,-37.2188 z m 130.9297,0 64.4629,37.2168 -64.4629,37.2188 -64.4629,-37.2168 z m 130.9238,0 64.4629,37.2188 -64.4629,37.2168 -64.4629,-37.2188 z m 130.9278,0 64.4648,37.2187 -64.4629,37.2169 -64.465,-37.2166 z m 130.9277,0 64.4609,37.2168 -64.4609,37.2188 -64.4629,-37.2188 z m -720.0977,37.7949 64.4629,37.2188 -64.4629,37.2168 -64.4629,-37.2168 z m 130.9278,0 64.4629,37.2168 -64.4629,37.2188 -64.4649,-37.2188 z m 130.9258,0 64.4628,37.2188 -64.4628,37.2168 -64.4629,-37.2168 z m 130.9277,0 64.4629,37.2168 -64.4649,37.2188 -64.4629,-37.2188 z m 130.9258,0 64.4629,37.2188 -64.4629,37.2168 -64.4629,-37.2168 z m 130.9257,0 64.4629,37.2188 -64.4629,37.2168 -64.4628,-37.2168 z m -720.0937,37.7948 64.4609,37.2188 -64.4609,37.2168 -64.4629,-37.2168 z m 130.9238,0 64.4629,37.2187 -64.4629,37.2168 -64.4629,-37.2168 z m 130.9297,0 64.4629,37.2187 -64.4648,37.2168 -64.4629,-37.2168 z m 130.9238,0 64.4629,37.2187 -64.4629,37.2168 -64.4628,-37.2168 z m 130.9278,0 64.4648,37.2187 -64.4648,37.2168 -64.4629,-37.2168 z m 130.9258,0 64.4629,37.2187 -64.4629,37.2168 -64.4629,-37.2168 z m 130.9277,0 64.4629,37.2187 -64.4629,37.2188 -64.4629,-37.2168 z m -720.0977,37.7949 64.4629,37.2187 -64.4629,37.2168 -64.4628,-37.2168 z m 261.8536,0 64.4628,37.2187 -64.4628,37.2168 -64.4629,-37.2168 z m 261.8535,0 64.4629,37.2187 -64.4629,37.2168 -64.4629,-37.2168 z m -392.7793,0 64.4629,37.2168 -64.4649,37.2187 -64.4609,-37.2188 z m 261.8515,0 64.465,37.2166 -64.4629,37.2187 -64.4629,-37.2187 z m 261.8535,0 64.4629,37.2168 -64.4609,37.2187 -64.4649,-37.2187 z m -720.0956,37.7929 64.4628,37.2188 -64.4628,37.2187 -64.4649,-37.2187 z m 654.6347,0 64.4629,37.2188 -64.4629,37.2187 -64.4648,-37.2187 z m -523.707,0 64.4629,37.2168 -64.4629,37.2188 -64.4629,-37.2188 z m 130.9238,0 64.465,37.2166 -64.4649,37.2187 -64.4628,-37.2187 z m 130.9297,0 64.4629,37.2168 -64.4629,37.2188 -64.4629,-37.2188 z m 130.9238,0 64.4629,37.2168 -64.4629,37.2188 -64.4609,-37.2189 z m 261.8535,0 64.4629,37.2168 -64.4629,37.2188 -64.4629,-37.2188 z m -720.0957,37.795 64.4629,37.2167 -64.4629,37.2188 -64.4629,-37.2168 z m 130.9258,0 64.465,37.2165 -64.4629,37.2188 -64.4629,-37.2188 z m 130.9278,0 64.4628,37.2187 -64.4628,37.2168 -64.4629,-37.2168 z m 130.9277,0 64.4629,37.2168 -64.4649,37.2187 -64.4609,-37.2188 z m 130.9258,-10e-5 64.4629,37.2188 -64.4629,37.2168 -64.4629,-37.2187 z m 130.9278,10e-5 64.4628,37.2168 -64.4649,37.2187 -64.4628,-37.2188 z m -720.0958,37.7948 64.4609,37.2168 -64.4629,37.2188 -64.4628,-37.2168 z m 130.9238,0 64.4629,37.2168 -64.4629,37.2188 -64.4629,-37.2188 z m 130.9278,0 64.4648,37.2188 -64.4629,37.2168 -64.4648,-37.2188 z m 130.9257,0 64.4629,37.2168 -64.4629,37.2188 -64.4628,-37.2168 z m 130.9278,0 64.4649,37.2166 -64.4648,37.2187 -64.4629,-37.2187 z m 130.9258,0 64.4629,37.2188 -64.4629,37.2168 -64.4629,-37.2188 z m 130.9277,0 64.4648,37.2188 -64.4648,37.2168 -64.4629,-37.2168 z m -720.0977,37.7949 64.4629,37.2168 -64.4629,37.2188 -64.4629,-37.2188 z m 130.9278,0 64.4629,37.2188 -64.4629,37.2187 -64.4649,-37.2187 z m 130.9258,0 64.4628,37.2168 -64.4628,37.2188 -64.4629,-37.2188 z m 130.9257,0 64.4649,37.2188 -64.4629,37.2187 -64.4649,-37.2187 z m 130.9277,0 64.4629,37.2168 -64.4628,37.2188 -64.4629,-37.2188 z m 130.9259,0 64.465,37.2166 -64.463,37.2187 -64.4628,-37.2187 z m -720.0977,37.793 64.4648,37.2187 -64.4648,37.2187 -64.4629,-37.2187 z m 130.9297,0 64.4629,37.2187 -64.4629,37.2168 -64.4629,-37.2168 z m 130.9258,0 64.4629,37.2187 -64.4649,37.2168 -64.4629,-37.2168 z m 130.9277,0 64.4629,37.2187 -64.4629,37.2168 -64.4629,-37.2168 z m 130.9238,0 64.4648,37.2187 -64.4647,37.2168 -64.463,-37.2168 z m 130.9297,0 64.4629,37.2187 -64.4628,37.2188 -64.463,-37.2188 z m 130.9258,0 64.461,37.2168 -64.461,37.2167 -64.4629,-37.2168 z m -589.1699,37.7929 64.4629,37.2188 -64.4629,37.2168 -64.4629,-37.2168 z m 261.8535,0 64.4629,37.2188 -64.4629,37.2168 -64.4629,-37.2168 z m 261.8535,0 64.4629,37.2188 -64.4629,37.2168 -64.4629,-37.2168 z m -654.6348,0 64.465,37.2166 -64.4648,37.2187 -64.4629,-37.2168 z m 261.8536,0 64.4628,37.2168 -64.4628,37.2188 -64.4629,-37.2188 z m 261.8535,0 64.4648,37.2188 -64.4648,37.2168 -64.4629,-37.2188 z m -589.1699,37.795 64.4628,37.2187 -64.4628,37.2168 -64.4629,-37.2188 z m 130.9257,0 64.4629,37.2167 -64.4648,37.2188 -64.461,-37.2168 z m 130.9278,0 64.4649,37.2165 -64.4648,37.2188 -64.4629,-37.2188 z m 130.9257,0 64.4629,37.2167 -64.4629,37.2188 -64.4628,-37.2188 z m 130.9278,0 64.4648,37.2187 -64.4629,37.2168 -64.4648,-37.2187 z m 130.9258,-10e-5 64.4628,37.2168 -64.4628,37.2188 -64.4629,-37.2168 z m 130.9277,10e-5 64.465,37.2165 -64.4649,37.2187 -64.4628,-37.2187 z m -720.0977,37.7949 64.4629,37.2168 -64.4629,37.2187 -64.4629,-37.2187 z m 130.9278,0 64.4629,37.2187 -64.4649,37.2168 -64.4629,-37.2168 z m 130.9258,0 64.4628,37.2168 -64.4628,37.2187 -64.4629,-37.2187 z m 130.9277,0 64.4629,37.2187 -64.4629,37.2168 -64.465,-37.2165 z m 130.9258,0 64.4629,37.2168 -64.463,37.2187 -64.4628,-37.2187 z m 130.9277,0 64.4629,37.2187 -64.4629,37.2168 -64.465,-37.2165 z m -720.0976,37.7949 64.4608,37.2188 -64.4628,37.2168 -64.4629,-37.2168 z m 130.9257,0 64.4649,37.2187 -64.4629,37.2168 -64.465,-37.2165 z m 130.9278,0 64.4629,37.2187 -64.4649,37.2168 -64.4629,-37.2168 z m 130.9277,0 64.4629,37.2187 -64.4629,37.2168 -64.4629,-37.2168 z m 130.9258,0 64.4629,37.2188 -64.4649,37.2168 -64.4609,-37.2168 z m 130.9277,0 64.4629,37.2187 -64.4629,37.2168 -64.4629,-37.2168 z m 130.9258,0 64.4629,37.2188 -64.4629,37.2168 -64.4649,-37.2166 z m -720.0977,37.7949 64.4629,37.2188 -64.4629,37.2187 -64.4629,-37.2187 z m 130.9258,0 64.4629,37.2188 -64.4629,37.2168 -64.4629,-37.2168 z m 130.9278,0 64.4648,37.2188 -64.4648,37.2187 -64.4629,-37.2187 z m 130.9277,0 64.4629,37.2188 -64.4629,37.2168 -64.4629,-37.2168 z m 130.9258,0 64.4648,37.2187 -64.4649,37.2188 -64.4628,-37.2187 z m 130.9277,0 64.4629,37.2188 -64.4629,37.2168 -64.4629,-37.2168 z m -720.0977,37.7949 64.4629,37.2188 -64.4628,37.2187 -64.4629,-37.2187 z m 654.6329,10e-5 64.4648,37.2187 -64.4648,37.2187 -64.463,-37.2187 z m -523.7071,0 64.4629,37.2168 -64.4629,37.2187 -64.4629,-37.2187 z m 130.9278,0 64.4649,37.2166 -64.4628,37.2187 -64.4649,-37.2187 z m 130.9257,0 64.4629,37.2168 -64.4629,37.2187 -64.4628,-37.2187 z m 130.9278,0 64.465,37.2166 -64.4629,37.2187 -64.4649,-37.2187 z m 261.8535,0 64.465,37.2166 -64.4629,37.2187 -64.4629,-37.2187 z m -720.0977,37.7949 64.4629,37.2168 -64.4629,37.2188 -64.4629,-37.2188 z m 130.9258,0 64.4649,37.2188 -64.4629,37.2168 -64.4649,-37.2188 z m 130.9278,0 64.4629,37.2168 -64.4629,37.2188 -64.4629,-37.2188 z m 130.9277,0 64.4629,37.2168 -64.4649,37.2188 -64.4629,-37.2168 z m 130.9258,0 64.465,37.2166 -64.463,37.2187 -64.4648,-37.2187 z m 130.9277,0 64.4629,37.2188 -64.4629,37.2168 -64.4629,-37.2168 z m -720.0996,37.7949 64.4629,37.2168 -64.4629,37.2188 -64.4629,-37.2169 z m 130.9297,0 64.4629,37.2188 -64.4629,37.2168 -64.4649,-37.2188 z m 130.9258,0 64.4629,37.2168 -64.4649,37.2188 -64.4609,-37.2168 z m 130.9277,10e-5 64.4629,37.2187 -64.4629,37.2168 -64.4629,-37.2188 z m 130.9258,-10e-5 64.4629,37.2168 -64.4649,37.2188 -64.4629,-37.2168 z m 130.9278,10e-5 64.4628,37.2187 -64.4629,37.2168 -64.4628,-37.2187 z"
       clip-path="none" />
    <g
       id="g67671"
       transform="matrix(0.3731905,0,0,0.37385455,139.41623,630.90356)"
       style="stroke-width:2.67721" />
    <rect
       style="opacity:0;fill:#441650;stroke-width:2.99999"
       id="rect11520"
       width="305"
       height="305"
       x="329.91824"
       y="1380.0189" />
  </g>
  <g
     id="g14040"
     style="display:inline"
     transform="translate(-524.60742,-1248.6342)">
    <path
       style="fill:#333333;stroke:none;stroke-width:2;stroke-linecap:butt;stroke-linejoin:miter;stroke-dasharray:6, 2;stroke-dashoffset:0;stroke-opacity:1"
       d="m 677.10742,1324.2712 -65.46334,37.7953 v 75.5906 l 65.46334,37.7953 65.46333,-37.7953 v -75.5906 z"
       id="path13950" />
    <path
       style="fill:#232323;fill-opacity:1;stroke:none;stroke-width:1px;stroke-linecap:butt;stroke-linejoin:miter;stroke-opacity:1"
       d="m 742.46084,1437.5952 -65.46094,-37.7939 v -75.468 l 65.57085,37.8574"
       id="path13952"
       sodipodi:nodetypes="cccc" />
    <path
       style="fill:none;stroke:#00ffff;stroke-width:2;stroke-linecap:butt;stroke-linejoin:miter;stroke-dasharray:none;stroke-dashoffset:0;stroke-opacity:1"
       d="m 677.10742,1324.2712 -65.46334,37.7953 v 75.5906 l 65.46334,37.7953 65.46333,-37.7953 v -75.5906 z"
       id="path13954" />
    <g
       id="g13968"
       transform="matrix(0.3731905,0,0,0.37385455,461.46052,1124.2125)"
       style="stroke-width:2.67721">
      <path
         style="fill:#ffcc00;stroke:none;stroke-width:5.35444;stroke-linecap:butt;stroke-linejoin:miter;stroke-dasharray:none;stroke-opacity:1"
         d="m 480.72002,717.58127 -65.46334,37.79528 v 75.59054 l 65.46334,37.79528 65.46333,-37.79528 v -75.59055 z"
         id="path13956" />
      <path
         style="fill:#ffaf00;fill-opacity:1;stroke:none;stroke-width:2.67721px;stroke-linecap:butt;stroke-linejoin:miter;stroke-opacity:1"
         d="m 546.18209,755.37581 -65.46334,37.79528 -65.46207,-37.79454 65.46334,-37.79528 z"
         id="path13958" />
      <path
         style="fill:#ffaf00;fill-opacity:1;stroke:none;stroke-width:2.67721px;stroke-linecap:butt;stroke-linejoin:miter;stroke-opacity:1"
         d="m 546.18335,755.37801 v 75.59054 l -65.46334,37.79528 v -75.59201 z"
         id="path13960" />
      <path
         style="fill:none;stroke:#ffe680;stroke-width:5.35444;stroke-linecap:round;stroke-linejoin:miter;stroke-dasharray:none;stroke-opacity:1"
         d="M 480.72002,868.76237 V 793.17036 L 415.25668,755.37655"
         id="path13962"
         sodipodi:nodetypes="ccc" />
      <path
         style="fill:none;fill-opacity:1;stroke:#ffe680;stroke-width:5.35444;stroke-linecap:round;stroke-linejoin:miter;stroke-dasharray:none;stroke-opacity:1"
         d="m 480.72001,793.17182 65.46334,-37.79381"
         id="path13964"
         sodipodi:nodetypes="cc" />
      <path
         style="fill:none;stroke:#ffcc00;stroke-width:5.35444;stroke-linecap:butt;stroke-linejoin:miter;stroke-dasharray:none;stroke-opacity:1"
         d="m 480.72002,717.58127 -65.46334,37.79528 v 75.59054 l 65.46334,37.79528 65.46333,-37.79528 v -75.59055 z"
         id="path13966" />
    </g>
    <g
       id="g13982"
       transform="matrix(0.3731905,0,0,0.37385455,532.08605,1124.3112)"
       style="stroke-width:2.67721">
      <path
         style="fill:#ffcc00;stroke:none;stroke-width:5.35444;stroke-linecap:butt;stroke-linejoin:miter;stroke-dasharray:none;stroke-opacity:1"
         d="m 480.72002,717.58127 -65.46334,37.79528 v 75.59054 l 65.46334,37.79528 65.46333,-37.79528 v -75.59055 z"
         id="path13970" />
      <path
         style="fill:#ffaf00;fill-opacity:1;stroke:none;stroke-width:2.67721px;stroke-linecap:butt;stroke-linejoin:miter;stroke-opacity:1"
         d="m 546.18209,755.37581 -65.46334,37.79528 -65.46207,-37.79454 65.46334,-37.79528 z"
         id="path13972" />
      <path
         style="fill:#ffaf00;fill-opacity:1;stroke:none;stroke-width:2.67721px;stroke-linecap:butt;stroke-linejoin:miter;stroke-opacity:1"
         d="m 546.18335,755.37801 v 75.59054 l -65.46334,37.79528 v -75.59201 z"
         id="path13974" />
      <path
         style="fill:none;stroke:#ffe680;stroke-width:5.35444;stroke-linecap:round;stroke-linejoin:miter;stroke-dasharray:none;stroke-opacity:1"
         d="M 480.72002,868.76237 V 793.17036 L 415.25668,755.37655"
         id="path13976"
         sodipodi:nodetypes="ccc" />
      <path
         style="fill:none;fill-opacity:1;stroke:#ffe680;stroke-width:5.35444;stroke-linecap:round;stroke-linejoin:miter;stroke-dasharray:none;stroke-opacity:1"
         d="m 480.72001,793.17182 65.46334,-37.79381"
         id="path13978"
         sodipodi:nodetypes="cc" />
      <path
         style="fill:none;stroke:#ffcc00;stroke-width:5.35444;stroke-linecap:butt;stroke-linejoin:miter;stroke-dasharray:none;stroke-opacity:1"
         d="m 480.72002,717.58127 -65.46334,37.79528 v 75.59054 l 65.46334,37.79528 65.46333,-37.79528 v -75.59055 z"
         id="path13980" />
    </g>
    <g
       id="g13996"
       transform="matrix(0.3731905,0,0,0.37385455,497.59975,1144.6502)"
       style="stroke-width:2.67721">
      <path
         style="fill:#ffcc00;stroke:none;stroke-width:5.35444;stroke-linecap:butt;stroke-linejoin:miter;stroke-dasharray:none;stroke-opacity:1"
         d="m 480.72002,717.58127 -65.46334,37.79528 v 75.59054 l 65.46334,37.79528 65.46333,-37.79528 v -75.59055 z"
         id="path13984" />
      <path
         style="fill:#ffdd55;stroke:none;stroke-width:2.67721px;stroke-linecap:butt;stroke-linejoin:miter;stroke-opacity:1"
         d="m 546.18209,755.37581 -65.46334,37.79528 -65.46207,-37.79454 65.46334,-37.79528 z"
         id="path13986" />
      <path
         style="fill:#ffaf00;fill-opacity:1;stroke:none;stroke-width:2.67721px;stroke-linecap:butt;stroke-linejoin:miter;stroke-opacity:1"
         d="m 546.18335,755.37801 v 75.59054 l -65.46334,37.79528 v -75.59201 z"
         id="path13988" />
      <path
         style="fill:none;stroke:#ffe680;stroke-width:5.35444;stroke-linecap:round;stroke-linejoin:miter;stroke-dasharray:none;stroke-opacity:1"
         d="M 480.72002,868.76237 V 793.17036 L 415.25668,755.37655"
         id="path13990"
         sodipodi:nodetypes="ccc" />
      <path
         style="fill:none;fill-opacity:1;stroke:#ffe680;stroke-width:5.35444;stroke-linecap:round;stroke-linejoin:miter;stroke-dasharray:none;stroke-opacity:1"
         d="m 480.72001,793.17182 65.46334,-37.79381"
         id="path13992"
         sodipodi:nodetypes="cc" />
      <path
         style="fill:none;stroke:#ffcc00;stroke-width:5.35444;stroke-linecap:butt;stroke-linejoin:miter;stroke-dasharray:none;stroke-opacity:1"
         d="m 480.72002,717.58127 -65.46334,37.79528 v 75.59054 l 65.46334,37.79528 65.46333,-37.79528 v -75.59055 z"
         id="path13994" />
    </g>
    <g
       id="g14010"
       transform="matrix(0.3731905,0,0,0.37385455,497.59975,1062.8704)"
       style="stroke-width:2.67721">
      <path
         style="fill:#ffcc00;stroke:none;stroke-width:5.35444;stroke-linecap:butt;stroke-linejoin:miter;stroke-dasharray:none;stroke-opacity:1"
         d="m 480.72002,717.58127 -65.46334,37.79528 v 75.59054 l 65.46334,37.79528 65.46333,-37.79528 v -75.59055 z"
         id="path13998" />
      <path
         style="fill:#ffdd55;stroke:none;stroke-width:2.67721px;stroke-linecap:butt;stroke-linejoin:miter;stroke-opacity:1"
         d="m 546.18209,755.37581 -65.46334,37.79528 -65.46207,-37.79454 65.46334,-37.79528 z"
         id="path14000" />
      <path
         style="fill:#ffaf00;fill-opacity:1;stroke:none;stroke-width:2.67721px;stroke-linecap:butt;stroke-linejoin:miter;stroke-opacity:1"
         d="m 546.18335,755.37801 v 75.59054 l -65.46334,37.79528 v -75.59201 z"
         id="path14002" />
      <path
         style="fill:none;stroke:#ffe680;stroke-width:5.35444;stroke-linecap:round;stroke-linejoin:miter;stroke-dasharray:none;stroke-opacity:1"
         d="M 480.72002,868.76237 V 793.17036 L 415.25668,755.37655"
         id="path14004"
         sodipodi:nodetypes="ccc" />
      <path
         style="fill:none;fill-opacity:1;stroke:#ffe680;stroke-width:5.35444;stroke-linecap:round;stroke-linejoin:miter;stroke-dasharray:none;stroke-opacity:1"
         d="m 480.72001,793.17182 65.46334,-37.79381"
         id="path14006"
         sodipodi:nodetypes="cc" />
      <path
         style="fill:none;stroke:#ffcc00;stroke-width:5.35444;stroke-linecap:butt;stroke-linejoin:miter;stroke-dasharray:none;stroke-opacity:1"
         d="m 480.72002,717.58127 -65.46334,37.79528 v 75.59054 l 65.46334,37.79528 65.46333,-37.79528 v -75.59055 z"
         id="path14008" />
    </g>
    <g
       id="g14024"
       transform="matrix(0.3731905,0,0,0.37385455,461.46052,1082.6587)"
       style="stroke-width:2.67721">
      <path
         style="fill:#ffcc00;stroke:none;stroke-width:5.35444;stroke-linecap:butt;stroke-linejoin:miter;stroke-dasharray:none;stroke-opacity:1"
         d="m 480.72002,717.58127 -65.46334,37.79528 v 75.59054 l 65.46334,37.79528 65.46333,-37.79528 v -75.59055 z"
         id="path14012" />
      <path
         style="fill:#ffdd55;stroke:none;stroke-width:2.67721px;stroke-linecap:butt;stroke-linejoin:miter;stroke-opacity:1"
         d="m 546.18209,755.37581 -65.46334,37.79528 -65.46207,-37.79454 65.46334,-37.79528 z"
         id="path14014" />
      <path
         style="fill:#ffaf00;fill-opacity:1;stroke:none;stroke-width:2.67721px;stroke-linecap:butt;stroke-linejoin:miter;stroke-opacity:1"
         d="m 546.18335,755.37801 v 75.59054 l -65.46334,37.79528 v -75.59201 z"
         id="path14016" />
      <path
         style="fill:none;stroke:#ffe680;stroke-width:5.35444;stroke-linecap:round;stroke-linejoin:miter;stroke-dasharray:none;stroke-opacity:1"
         d="M 480.72002,868.76237 V 793.17036 L 415.25668,755.37655"
         id="path14018"
         sodipodi:nodetypes="ccc" />
      <path
         style="fill:none;fill-opacity:1;stroke:#ffe680;stroke-width:5.35444;stroke-linecap:round;stroke-linejoin:miter;stroke-dasharray:none;stroke-opacity:1"
         d="m 480.72001,793.17182 65.46334,-37.79381"
         id="path14020"
         sodipodi:nodetypes="cc" />
      <path
         style="fill:none;stroke:#ffcc00;stroke-width:5.35444;stroke-linecap:butt;stroke-linejoin:miter;stroke-dasharray:none;stroke-opacity:1"
         d="m 480.72002,717.58127 -65.46334,37.79528 v 75.59054 l 65.46334,37.79528 65.46333,-37.79528 v -75.59055 z"
         id="path14022" />
    </g>
    <g
       id="g14038"
       transform="matrix(0.3731905,0,0,0.37385455,532.08605,1082.7574)"
       style="stroke-width:2.67721">
      <path
         style="fill:#ffcc00;stroke:none;stroke-width:5.35444;stroke-linecap:butt;stroke-linejoin:miter;stroke-dasharray:none;stroke-opacity:1"
         d="m 480.72002,717.58127 -65.46334,37.79528 v 75.59054 l 65.46334,37.79528 65.46333,-37.79528 v -75.59055 z"
         id="path14026" />
      <path
         style="fill:#ffdd55;stroke:none;stroke-width:2.67721px;stroke-linecap:butt;stroke-linejoin:miter;stroke-opacity:1"
         d="m 546.18209,755.37581 -65.46334,37.79528 -65.46207,-37.79454 65.46334,-37.79528 z"
         id="path14028" />
      <path
         style="fill:#ffaf00;fill-opacity:1;stroke:none;stroke-width:2.67721px;stroke-linecap:butt;stroke-linejoin:miter;stroke-opacity:1"
         d="m 546.18335,755.37801 v 75.59054 l -65.46334,37.79528 v -75.59201 z"
         id="path14030" />
      <path
         style="fill:none;stroke:#ffe680;stroke-width:5.35444;stroke-linecap:round;stroke-linejoin:miter;stroke-dasharray:none;stroke-opacity:1"
         d="M 480.72002,868.76237 V 793.17036 L 415.25668,755.37655"
         id="path14032"
         sodipodi:nodetypes="ccc" />
      <path
         style="fill:none;fill-opacity:1;stroke:#ffe680;stroke-width:5.35444;stroke-linecap:round;stroke-linejoin:miter;stroke-dasharray:none;stroke-opacity:1"
         d="m 480.72001,793.17182 65.46334,-37.79381"
         id="path14034"
         sodipodi:nodetypes="cc" />
      <path
         style="fill:none;stroke:#ffcc00;stroke-width:5.35444;stroke-linecap:butt;stroke-linejoin:miter;stroke-dasharray:none;stroke-opacity:1"
         d="m 480.72002,717.58127 -65.46334,37.79528 v 75.59054 l 65.46334,37.79528 65.46333,-37.79528 v -75.59055 z"
         id="path14036" />
    </g>
  </g>
</svg>
