digraph "Guix package" {
  "29061504" [label = "make-boot0@4.2.1", shape = box, fontname = Helvetica];
  "29061504" -> "43943040" [color = cyan3];
  "29061504" -> "43942848" [color = cyan3];
  "29061504" -> "43942656" [color = cyan3];
  "29061504" -> "43942464" [color = cyan3];
  "29061504" -> "43942464" [color = cyan3];
  "43943040" [label = "glibc-bootstrap@0", shape = box, fontname = Helvetica];
  "43942848" [label = "gcc-bootstrap@0", shape = box, fontname = Helvetica];
  "43942848" -> "43943040" [color = darkviolet];
  "43942656" [label = "binutils-bootstrap@0", shape = box, fontname = Helvetica];
  "43942464" [label = "bootstrap-binaries@0", shape = box, fontname = Helvetica];

}
