<?xml version="1.0" encoding="UTF-8" standalone="no"?>
<!-- Created with Inkscape (http://www.inkscape.org/) -->

<svg
   xmlns:dc="http://purl.org/dc/elements/1.1/"
   xmlns:cc="http://creativecommons.org/ns#"
   xmlns:rdf="http://www.w3.org/1999/02/22-rdf-syntax-ns#"
   xmlns:svg="http://www.w3.org/2000/svg"
   xmlns="http://www.w3.org/2000/svg"
   xmlns:xlink="http://www.w3.org/1999/xlink"
   xmlns:sodipodi="http://sodipodi.sourceforge.net/DTD/sodipodi-0.dtd"
   xmlns:inkscape="http://www.inkscape.org/namespaces/inkscape"
   width="1920"
   height="1080"
   viewBox="0 0 507.99999 285.75001"
   version="1.1"
   id="svg8"
   inkscape:version="0.92.3 (2405546, 2018-03-11)"
   sodipodi:docname="functional1b.svg">
  <defs
     id="defs2">
    <inkscape:perspective
       sodipodi:type="inkscape:persp3d"
       inkscape:vp_x="0 : 142.875 : 1"
       inkscape:vp_y="0 : 1000 : 0"
       inkscape:vp_z="507.99999 : 142.875 : 1"
       inkscape:persp3d-origin="254 : 95.250003 : 1"
       id="perspective9456" />
    <inkscape:path-effect
       effect="bspline"
       id="path-effect4268"
       is_visible="true"
       weight="33.333333"
       steps="2"
       helper_size="0"
       apply_no_weight="true"
       apply_with_weight="true"
       only_selected="false" />
    <linearGradient
       id="linearGradient4094">
      <stop
         style="stop-color:#232323;stop-opacity:1;"
         offset="0"
         id="stop4096" />
      <stop
         style="stop-color:#4d4d4d;stop-opacity:1;"
         offset="1"
         id="stop4098" />
    </linearGradient>
    <linearGradient
       id="linearGradient4014">
      <stop
         style="stop-color:#a0a0a0;stop-opacity:1;"
         offset="0"
         id="stop4016" />
      <stop
         style="stop-color:#ffffff;stop-opacity:1;"
         offset="1"
         id="stop4018" />
    </linearGradient>
    <linearGradient
       id="linearGradient4678">
      <stop
         style="stop-color:#e5e5e5;stop-opacity:1;"
         offset="0"
         id="stop4680" />
      <stop
         style="stop-color:#d3cdcd;stop-opacity:1;"
         offset="1"
         id="stop4682" />
    </linearGradient>
    <linearGradient
       id="linearGradient4341">
      <stop
         id="stop4343"
         offset="0"
         style="stop-color:#333333;stop-opacity:1;" />
      <stop
         id="stop4345"
         offset="1"
         style="stop-color:#484848;stop-opacity:1;" />
    </linearGradient>
    <linearGradient
       id="linearGradient4696-5">
      <stop
         id="stop4698-6"
         offset="0"
         style="stop-color:#ffb638;stop-opacity:1;" />
      <stop
         id="stop4700-2"
         offset="1"
         style="stop-color:#f0ae26;stop-opacity:1;" />
    </linearGradient>
    <linearGradient
       id="linearGradient4702-3">
      <stop
         id="stop4704-1"
         offset="0"
         style="stop-color:#e34646;stop-opacity:1;" />
      <stop
         id="stop4706-8"
         offset="1"
         style="stop-color:#ffbf2d;stop-opacity:1;" />
    </linearGradient>
    <color-profile
       name="Artifex-PS-CMYK-Profile"
       xlink:href="/usr/share/color/icc/ghostscript/ps_cmyk.icc"
       id="color-profile2657" />
    <clipPath
       id="clipPath4501"
       clipPathUnits="userSpaceOnUse">
      <path
         style="clip-rule:evenodd"
         inkscape:connector-curvature="0"
         id="path4499"
         d="M 0,0 H 124.992 V 144 H 0 Z" />
    </clipPath>
    <clipPath
       id="clipPath4525"
       clipPathUnits="userSpaceOnUse">
      <path
         inkscape:connector-curvature="0"
         id="path4523"
         d="M 0,0 H 100 V 125 H 0 Z" />
    </clipPath>
    <clipPath
       id="clipPath4545"
       clipPathUnits="userSpaceOnUse">
      <path
         inkscape:connector-curvature="0"
         id="path4543"
         d="M 0,0 H 100 V 125 H 0 Z" />
    </clipPath>
    <clipPath
       id="clipPath4561"
       clipPathUnits="userSpaceOnUse">
      <path
         inkscape:connector-curvature="0"
         id="path4559"
         d="M 0,0 H 100 V 125 H 0 Z" />
    </clipPath>
    <clipPath
       id="clipPath4577"
       clipPathUnits="userSpaceOnUse">
      <path
         inkscape:connector-curvature="0"
         id="path4575"
         d="M 0,0 H 100 V 125 H 0 Z" />
    </clipPath>
    <clipPath
       id="clipPath4593"
       clipPathUnits="userSpaceOnUse">
      <path
         inkscape:connector-curvature="0"
         id="path4591"
         d="M 0,0 H 100 V 125 H 0 Z" />
    </clipPath>
    <clipPath
       id="clipPath4609"
       clipPathUnits="userSpaceOnUse">
      <path
         inkscape:connector-curvature="0"
         id="path4607"
         d="M 0,0 H 100 V 125 H 0 Z" />
    </clipPath>
    <clipPath
       id="clipPath4625"
       clipPathUnits="userSpaceOnUse">
      <path
         inkscape:connector-curvature="0"
         id="path4623"
         d="M 0,0 H 100 V 125 H 0 Z" />
    </clipPath>
    <clipPath
       id="clipPath4641"
       clipPathUnits="userSpaceOnUse">
      <path
         inkscape:connector-curvature="0"
         id="path4639"
         d="M 0,0 H 100 V 125 H 0 Z" />
    </clipPath>
    <clipPath
       id="clipPath4657"
       clipPathUnits="userSpaceOnUse">
      <path
         inkscape:connector-curvature="0"
         id="path4655"
         d="M 0,0 H 100 V 125 H 0 Z" />
    </clipPath>
    <clipPath
       id="clipPath4673"
       clipPathUnits="userSpaceOnUse">
      <path
         inkscape:connector-curvature="0"
         id="path4671"
         d="M 0,0 H 100 V 125 H 0 Z" />
    </clipPath>
    <style
       id="style3894"
       type="text/css"><![CDATA[
    line, polyline, path, rect, circle {
      fill: none;
      stroke: #000000;
      stroke-linecap: round;
      stroke-linejoin: round;
      stroke-miterlimit: 10.00;
    }
  ]]></style>
    <clipPath
       id="cpNzMuMDYyM3w1NDYuMzIzfDM5My4wNzJ8MzEuMDU2Nw==">
      <rect
         id="rect3902"
         height="362.02"
         width="473.26"
         y="31.06"
         x="73.06" />
    </clipPath>
    <clipPath
       id="cpMHw3MDguNjYxfDUwMy40MjV8MA==">
      <rect
         id="rect3995"
         height="503.43"
         width="708.66"
         y="0.00"
         x="0.00" />
    </clipPath>
    <marker
       inkscape:stockid="Arrow2Send"
       orient="auto"
       refY="0"
       refX="0"
       id="Arrow2Send-3-3"
       style="overflow:visible"
       inkscape:isstock="true">
      <path
         inkscape:connector-curvature="0"
         id="path6389-4-7"
         style="fill:#ffbf2d;fill-opacity:1;fill-rule:evenodd;stroke:#ffbf2d;stroke-width:0.625;stroke-linejoin:round;stroke-opacity:1"
         d="M 8.7185878,4.0337352 -2.2072895,0.01601326 8.7185884,-4.0017078 c -1.7454984,2.3720609 -1.7354408,5.6174519 -6e-7,8.035443 z"
         transform="matrix(-0.3,0,0,-0.3,0.69,0)" />
    </marker>
    <marker
       inkscape:stockid="Arrow2Send"
       orient="auto"
       refY="0"
       refX="0"
       id="Arrow2Send-3-3-6"
       style="overflow:visible"
       inkscape:isstock="true">
      <path
         inkscape:connector-curvature="0"
         id="path6389-4-7-3"
         style="fill:#ffbf2d;fill-opacity:1;fill-rule:evenodd;stroke:#ffbf2d;stroke-width:0.625;stroke-linejoin:round;stroke-opacity:1"
         d="M 8.7185878,4.0337352 -2.2072895,0.01601326 8.7185884,-4.0017078 c -1.7454984,2.3720609 -1.7354408,5.6174519 -6e-7,8.035443 z"
         transform="matrix(-0.3,0,0,-0.3,0.69,0)" />
    </marker>
  </defs>
  <sodipodi:namedview
     id="base"
     pagecolor="#ffffff"
     bordercolor="#f70bff"
     borderopacity="1"
     inkscape:pageopacity="0.0"
     inkscape:pageshadow="2"
     inkscape:zoom="0.49497475"
     inkscape:cx="788.78056"
     inkscape:cy="594.28301"
     inkscape:document-units="px"
     inkscape:current-layer="layer1"
     showgrid="false"
     units="px"
     borderlayer="true"
     inkscape:showpageshadow="false"
     inkscape:pagecheckerboard="true"
     inkscape:window-width="1920"
     inkscape:window-height="951"
     inkscape:window-x="0"
     inkscape:window-y="55"
     inkscape:window-maximized="1"
     showguides="false" />
  <metadata
     id="metadata5">
    <rdf:RDF>
      <cc:Work
         rdf:about="">
        <dc:format>image/svg+xml</dc:format>
        <dc:type
           rdf:resource="http://purl.org/dc/dcmitype/StillImage" />
        <dc:title></dc:title>
        <cc:license
           rdf:resource="http://creativecommons.org/licenses/by-sa/4.0/" />
      </cc:Work>
      <cc:License
         rdf:about="http://creativecommons.org/licenses/by-sa/4.0/">
        <cc:permits
           rdf:resource="http://creativecommons.org/ns#Reproduction" />
        <cc:permits
           rdf:resource="http://creativecommons.org/ns#Distribution" />
        <cc:requires
           rdf:resource="http://creativecommons.org/ns#Notice" />
        <cc:requires
           rdf:resource="http://creativecommons.org/ns#Attribution" />
        <cc:permits
           rdf:resource="http://creativecommons.org/ns#DerivativeWorks" />
        <cc:requires
           rdf:resource="http://creativecommons.org/ns#ShareAlike" />
      </cc:License>
    </rdf:RDF>
  </metadata>
  <g
     inkscape:label="Layer 1"
     inkscape:groupmode="layer"
     id="layer1"
     transform="translate(0,-11.249975)">
    <rect
       style="color:#000000;clip-rule:nonzero;display:inline;overflow:visible;visibility:visible;opacity:1;isolation:auto;mix-blend-mode:normal;color-interpolation:sRGB;color-interpolation-filters:linearRGB;solid-color:#000000;solid-opacity:1;vector-effect:none;fill:#232323;fill-opacity:1;fill-rule:nonzero;stroke:none;stroke-width:0.3055087;stroke-linecap:round;stroke-linejoin:round;stroke-miterlimit:4;stroke-dasharray:none;stroke-dashoffset:0;stroke-opacity:1;color-rendering:auto;image-rendering:auto;shape-rendering:auto;text-rendering:auto;enable-background:accumulate"
       id="rect2926"
       width="512.95203"
       height="292.72192"
       x="-2.0354033"
       y="8.4516382" />
    <path
       style="fill:none;fill-rule:evenodd;stroke:#ffffff;stroke-width:2.12589979;stroke-linecap:round;stroke-linejoin:round;stroke-miterlimit:4;stroke-dasharray:none;stroke-opacity:1;enable-background:new"
       d="m 218.49069,107.88115 -4.25181,8.50359 v 8.50362 h 45.00162 v 37.21612 h -8.50358 v 8.50359 l 4.25181,8.50361 m -19.28498,0 4.25181,-8.50361 v -8.50359 h -44.84979 v -37.21612 h 8.50361 v -8.50362 l -4.25179,-8.50359"
       id="path4204-8"
       inkscape:connector-curvature="0"
       sodipodi:nodetypes="cccccccccccccccc"
       inkscape:export-xdpi="90"
       inkscape:export-ydpi="90" />
    <text
       xml:space="preserve"
       style="font-style:normal;font-weight:normal;font-size:10.54716396px;line-height:0%;font-family:sans-serif;letter-spacing:0px;word-spacing:0px;fill:#ffffff;fill-opacity:1;stroke:none;stroke-width:0.87893027px;stroke-linecap:butt;stroke-linejoin:miter;stroke-opacity:1;enable-background:new"
       x="73.203712"
       y="57.664558"
       id="text4363"
       inkscape:export-xdpi="90"
       inkscape:export-ydpi="90"><tspan
         sodipodi:role="line"
         x="73.203712"
         y="57.664558"
         id="tspan4367"
         style="font-style:normal;font-variant:normal;font-weight:normal;font-stretch:normal;font-size:13.18395519px;line-height:100%;font-family:'Droid Serif';-inkscape-font-specification:'Droid Serif';text-align:start;text-anchor:start;fill:#ffffff;fill-opacity:1;stroke-width:0.87893027px">headers</tspan><tspan
         id="tspan3374"
         sodipodi:role="line"
         x="73.203712"
         y="70.848511"
         style="font-style:normal;font-variant:normal;font-weight:normal;font-stretch:normal;font-size:13.18395519px;line-height:100%;font-family:'Droid Serif';-inkscape-font-specification:'Droid Serif';text-align:start;text-anchor:start;fill:#ffffff;fill-opacity:1;stroke-width:0.87893027px">sources</tspan><tspan
         id="tspan3376"
         sodipodi:role="line"
         x="73.203712"
         y="84.032471"
         style="font-style:normal;font-variant:normal;font-weight:normal;font-stretch:normal;font-size:13.18395519px;line-height:100%;font-family:'Droid Serif';-inkscape-font-specification:'Droid Serif';text-align:start;text-anchor:start;fill:#ffffff;fill-opacity:1;stroke-width:0.87893027px">build tools</tspan><tspan
         sodipodi:role="line"
         x="73.203712"
         y="97.216423"
         id="tspan4379"
         style="font-style:normal;font-variant:normal;font-weight:normal;font-stretch:normal;font-size:13.18395519px;line-height:100%;font-family:'Droid Serif';-inkscape-font-specification:'Droid Serif';text-align:start;text-anchor:start;fill:#ffffff;fill-opacity:1;stroke-width:0.87893027px">libraries</tspan><tspan
         sodipodi:role="line"
         x="73.203712"
         y="110.40038"
         style="font-style:normal;font-variant:normal;font-weight:normal;font-stretch:normal;font-size:13.18395519px;line-height:100%;font-family:'Droid Serif';-inkscape-font-specification:'Droid Serif';text-align:start;text-anchor:start;fill:#ffffff;fill-opacity:1;stroke-width:0.87893027px"
         id="tspan12954">...</tspan></text>
    <path
       inkscape:connector-curvature="0"
       id="path31462"
       d="m 232.76711,117.03579 c 0.054,-0.0229 0.14219,-0.0229 0.19615,0 0.054,0.0229 0.009,0.0394 -0.098,0.0394 -0.10787,0 -0.15189,-0.0171 -0.0982,-0.0394 z"
       style="opacity:1;fill:#69faff;fill-opacity:1;stroke:none;stroke-width:3.51572108;stroke-linecap:round;stroke-linejoin:miter;stroke-miterlimit:4;stroke-dasharray:none;stroke-dashoffset:0;stroke-opacity:1;enable-background:new" />
    <path
       sodipodi:nodetypes="csc"
       inkscape:connector-curvature="0"
       id="path17911-9-2"
       d="m 141.56502,67.913628 c 0,0 35.93375,-16.145681 58.30881,7.840599 7.6754,8.228099 9.5705,32.371673 9.5705,32.371673"
       style="fill:none;fill-rule:evenodd;stroke:#ffbf2d;stroke-width:3.28822017;stroke-linecap:round;stroke-linejoin:miter;stroke-miterlimit:4;stroke-dasharray:none;stroke-opacity:1;marker-end:url(#Arrow2Send-3-3-6);enable-background:new" />
    <text
       xml:space="preserve"
       style="font-style:normal;font-variant:normal;font-weight:normal;font-stretch:normal;font-size:25.40000153px;line-height:6.61458349px;font-family:'Century Schoolbook L';-inkscape-font-specification:'Century Schoolbook L';letter-spacing:0px;word-spacing:0px;fill:#000000;fill-opacity:1;stroke:none;stroke-width:0.26458335px;stroke-linecap:butt;stroke-linejoin:miter;stroke-opacity:1;"
       x="238.13715"
       y="144.99043"
       id="text9454"><tspan
         sodipodi:role="line"
         id="tspan9452"
         x="238.13715"
         y="154.26672"
         style="font-style:normal;font-variant:normal;font-weight:normal;font-stretch:normal;font-family:'Century Schoolbook L';-inkscape-font-specification:'Century Schoolbook L';stroke-width:0.26458335px;" /></text>
    <g
       id="g9521">
      <path
         sodipodi:nodetypes="ccccccccscccscscsccscsccccccccccccccccccccccccccccsccccccccccsccscccccc"
         style="fill:#ffbf2d;fill-opacity:1;stroke:none;stroke-width:0.87893027;stroke-linecap:round;stroke-linejoin:round;stroke-miterlimit:10;enable-background:new"
         d="m 201.87613,152.49795 c -1.17289,-0.63792 -0.90033,-2.14789 0.389,-2.1552 0.63482,-0.002 0.86755,0.45212 0.5472,1.07158 -0.223,0.43128 -0.21957,0.49352 0.0334,0.59055 0.1556,0.0596 0.6178,-0.0542 1.02745,-0.25327 1.19036,-0.57831 1.53048,-1.36495 3.36546,-7.78412 l 1.64939,-5.76989 -1.08963,-0.0508 c -1.02818,-0.048 -1.08963,-0.0748 -1.08963,-0.47364 0,-0.36131 0.0813,-0.42326 0.55979,-0.4265 0.30786,-0.001 0.87609,-0.14732 1.26272,-0.32306 0.60958,-0.27696 0.80034,-0.51313 1.43623,-1.77888 1.47794,-2.94203 2.96813,-4.26702 4.79895,-4.26702 0.79284,0 0.99709,0.072 1.42858,0.50346 0.83735,0.83737 0.54495,1.90785 -0.52119,1.90785 -0.81566,0 -1.01112,-0.45324 -0.6127,-1.42096 0.10273,-0.24954 0.0309,-0.3014 -0.41715,-0.3014 -1.14437,0 -1.81872,0.85789 -2.84885,3.6243 -0.3336,0.8959 -0.60693,1.7258 -0.60738,1.8442 -5.1e-4,0.14048 0.26867,0.21529 0.77422,0.21529 0.77567,0 0.86601,0.0793 0.67051,0.58874 -0.0754,0.19672 -0.33712,0.2724 -0.94064,0.2724 h -0.83613 l -0.19187,0.732 c -1.47151,5.61389 -2.63267,8.97285 -3.75183,10.85332 -1.37535,2.31087 -3.6308,3.5655 -5.03588,2.8013 z m 12.54702,-2.27984 c -1.1712,-2.58754 -1.43159,-3.9246 -1.16841,-6.0002 0.39117,-3.08547 1.92551,-5.4917 5.24317,-8.22265 1.53645,-1.26475 1.85121,-1.02222 0.4252,0.3276 -1.36834,1.29521 -2.4168,2.90961 -3.19015,4.9121 -1.33237,3.44988 -1.60815,6.31391 -0.83581,8.67985 0.59259,1.81534 0.29626,2.00501 -0.474,0.3033 z m 32.43591,1.02622 c 1.4e-4,-0.0711 0.47559,-0.59419 1.05647,-1.16258 1.83985,-1.80013 3.00378,-4.02231 3.83661,-7.32484 0.60776,-2.41023 0.61019,-4.35394 0.009,-6.14898 -0.57364,-1.70876 -0.30948,-2.03317 0.41206,-0.50604 1.01332,2.14467 1.31412,3.32616 1.30092,5.10972 -0.0257,3.49424 -1.5783,6.23281 -5.28808,9.32812 -0.94973,0.79241 -1.32624,0.99256 -1.32561,0.7046 z m -29.08611,-3.6025 c -0.38924,-0.15675 -0.58661,-0.71526 -0.38555,-1.09093 0.22442,-0.41904 0.80763,-0.44631 1.23696,-0.0577 0.29723,0.26897 0.34311,0.26183 0.74384,-0.11448 0.23499,-0.22071 0.74864,-0.89483 1.14171,-1.49813 l 0.7147,-1.09693 -0.3115,-1.1507 c -0.37627,-1.39001 -0.8596,-1.93798 -1.70939,-1.93798 -0.74787,0 -0.8512,-0.45969 -0.13706,-0.6095 0.2604,-0.0548 0.82128,-0.17816 1.24619,-0.27438 0.73193,-0.16589 0.7923,-0.15019 1.14831,0.29631 0.20672,0.25926 0.48496,0.86368 0.61838,1.34332 l 0.2427,0.87204 0.47521,-0.81088 c 0.81662,-1.39348 1.91728,-2.08908 2.66905,-1.68674 0.43505,0.2327 0.48922,1.06524 0.0909,1.39589 -0.21443,0.17815 -0.38615,0.18158 -0.83898,0.0171 -0.31311,-0.11339 -0.68563,-0.16133 -0.82781,-0.10678 -0.38591,0.14819 -1.33601,1.54564 -1.33601,1.96522 0,0.45283 0.665,3.13598 0.8524,3.43918 0.18158,0.29371 0.71933,0.011 1.1079,-0.58163 0.30996,-0.47308 0.62323,-0.57744 0.62323,-0.20758 0,0.34842 -1.52765,1.82465 -2.01472,1.94692 -0.66415,0.16673 -1.07425,-0.38843 -1.40547,-1.90244 l -0.2891,-1.32133 -0.90692,1.30458 c -1.12402,1.61679 -1.95996,2.18447 -2.74886,1.86664 z"
         id="path31529"
         inkscape:connector-curvature="0" />
      <g
         id="text9460"
         style="font-style:normal;font-variant:normal;font-weight:normal;font-stretch:normal;font-size:25.40000153px;line-height:6.61458349px;font-family:'League Gothic';-inkscape-font-specification:'League Gothic';letter-spacing:0px;word-spacing:0px;fill:#ffbf2d;fill-opacity:1;stroke:none;stroke-width:0.26458335px;stroke-linecap:butt;stroke-linejoin:miter;stroke-opacity:1"
         aria-label=",">
        <path
           id="path9480"
           style="font-style:italic;font-variant:normal;font-weight:normal;font-stretch:normal;font-size:16.93333435px;font-family:'Linux Libertine';-inkscape-font-specification:'Linux Libertine Italic';fill:#ffbf2d;fill-opacity:1;stroke-width:0.26458335px;stroke:none"
           d="m 226.73299,146.56836 q 0,-0.37207 0.29765,-0.61185 0.29766,-0.23977 0.7028,-0.23977 0.40515,0 0.65319,0.29765 0.25632,0.29766 0.25632,0.79375 0,0.5209 -0.19017,1.03353 -0.1819,0.5209 -0.76068,1.03353 -0.57051,0.5209 -1.48828,0.68626 -0.19844,-0.16536 -0.14056,-0.3886 0.65319,-0.14883 1.20716,-0.62839 0.56224,-0.47956 0.56224,-0.84336 0,-0.13229 -0.0827,-0.23151 -0.0827,-0.091 -0.1819,-0.12402 -0.091,-0.0331 -0.25632,-0.0827 -0.57877,-0.14882 -0.57877,-0.69453 z" />
      </g>
      <g
         id="text9460-5"
         style="font-style:normal;font-variant:normal;font-weight:normal;font-stretch:normal;font-size:25.40000153px;line-height:6.61458349px;font-family:'League Gothic';-inkscape-font-specification:'League Gothic';letter-spacing:0px;word-spacing:0px;fill:#ffbf2d;fill-opacity:1;stroke:none;stroke-width:0.26458335px;stroke-linecap:butt;stroke-linejoin:miter;stroke-opacity:1"
         aria-label="y…">
        <path
           id="path9483"
           style="font-style:italic;font-variant:normal;font-weight:normal;font-stretch:normal;font-size:16.93333435px;font-family:'Linux Libertine';-inkscape-font-specification:'Linux Libertine Italic';fill:#ffbf2d;fill-opacity:1;stroke-width:0.26458335px;stroke:none"
           d="m 235.43058,146.93259 -0.76894,1.18235 q -0.81029,1.25677 -1.73633,2.01745 -0.92604,0.76068 -1.60404,0.76068 -0.32246,0 -0.67799,-0.17363 -0.35553,-0.16537 -0.35553,-0.53744 0,-0.37207 0.24804,-0.62012 0.24805,-0.23977 0.53744,-0.23977 0.32246,0 0.58704,0.23151 0.37207,0.30592 0.59531,0.30592 0.19017,0 0.66973,-0.53743 0.47956,-0.52917 0.97565,-1.33946 0.14883,-0.339 -0.15709,-2.67064 -0.30593,-2.33991 -0.678,-3.61321 -0.1571,-0.53744 -0.26458,-0.71107 -0.11576,-0.19844 -0.47129,-0.19017 -0.339,0 -1.10794,0.3638 -0.17364,-0.16536 -0.22325,-0.5209 0.4961,-0.3638 1.2237,-0.75241 0.73587,-0.3886 1.01699,-0.3886 0.30593,0 0.4961,0.28112 0.19843,0.28112 0.38034,0.96738 0.34726,1.43867 0.48782,2.68718 0.14883,1.24023 0.23978,2.98483 l 0.11575,0.0496 q 0.19017,-0.28112 0.5209,-0.79375 0.3142,-0.52917 0.54571,-0.89297 l 0.23151,-0.36381 q 1.2733,-2.00091 1.28157,-2.92695 0,-0.47956 -0.35553,-1.01699 -0.0909,-0.14056 -0.0909,-0.34727 0,-0.62838 0.78548,-0.62838 0.8847,0 0.8847,0.80202 0,0.73587 -0.45475,1.80247 -0.21498,0.49609 -0.82682,1.52135 -0.60359,1.02527 -0.96739,1.59577 z" />
        <path
           id="path9485"
           style="font-style:italic;font-variant:normal;font-weight:normal;font-stretch:normal;font-size:16.93333435px;font-family:'Linux Libertine';-inkscape-font-specification:'Linux Libertine Italic';fill:#ffbf2d;fill-opacity:1;stroke-width:0.26458335px;stroke:none"
           d="m 248.07271,145.32028 q 0.33899,0 0.56224,0.21498 0.22324,0.21497 0.22324,0.53743 0,0.38861 -0.31419,0.71934 -0.3142,0.33073 -0.73588,0.33073 -0.33899,0 -0.56224,-0.23151 -0.22324,-0.23151 -0.22324,-0.55398 0,-0.37207 0.30593,-0.69453 0.30592,-0.32246 0.74414,-0.32246 z m -4.46485,0 q 0.339,0 0.55397,0.21498 0.22325,0.21497 0.22325,0.53743 0,0.38861 -0.3142,0.71934 -0.31419,0.33073 -0.73587,0.33073 -0.339,0 -0.56224,-0.23151 -0.21497,-0.23151 -0.21497,-0.55398 0,-0.37207 0.30592,-0.69453 0.30593,-0.32246 0.74414,-0.32246 z m -4.48965,0 q 0.339,0 0.55398,0.21498 0.22324,0.21497 0.22324,0.53743 0,0.38861 -0.31419,0.71934 -0.3142,0.33073 -0.73588,0.33073 -0.32246,0 -0.55397,-0.23151 -0.22324,-0.23151 -0.22324,-0.55398 0,-0.37207 0.30592,-0.69453 0.30593,-0.32246 0.74414,-0.32246 z" />
      </g>
    </g>
  </g>
</svg>
