<?xml version="1.0" encoding="UTF-8" standalone="no"?>
<!-- Created with Inkscape (http://www.inkscape.org/) -->

<svg
   xmlns:dc="http://purl.org/dc/elements/1.1/"
   xmlns:cc="http://creativecommons.org/ns#"
   xmlns:rdf="http://www.w3.org/1999/02/22-rdf-syntax-ns#"
   xmlns:svg="http://www.w3.org/2000/svg"
   xmlns="http://www.w3.org/2000/svg"
   xmlns:xlink="http://www.w3.org/1999/xlink"
   xmlns:sodipodi="http://sodipodi.sourceforge.net/DTD/sodipodi-0.dtd"
   xmlns:inkscape="http://www.inkscape.org/namespaces/inkscape"
   width="1920"
   height="1080"
   viewBox="0 0 507.99999 285.75001"
   version="1.1"
   id="svg8"
   inkscape:version="0.92.3 (2405546, 2018-03-11)"
   sodipodi:docname="use-manifest-1.svg">
  <defs
     id="defs2">
    <inkscape:path-effect
       effect="bspline"
       id="path-effect10907"
       is_visible="true"
       weight="33.333333"
       steps="2"
       helper_size="0"
       apply_no_weight="true"
       apply_with_weight="true"
       only_selected="false" />
    <inkscape:perspective
       sodipodi:type="inkscape:persp3d"
       inkscape:vp_x="0 : 142.875 : 1"
       inkscape:vp_y="0 : 1000 : 0"
       inkscape:vp_z="507.99999 : 142.875 : 1"
       inkscape:persp3d-origin="254 : 95.250003 : 1"
       id="perspective9456" />
    <inkscape:path-effect
       effect="bspline"
       id="path-effect4268"
       is_visible="true"
       weight="33.333333"
       steps="2"
       helper_size="0"
       apply_no_weight="true"
       apply_with_weight="true"
       only_selected="false" />
    <linearGradient
       id="linearGradient4094">
      <stop
         style="stop-color:#232323;stop-opacity:1;"
         offset="0"
         id="stop4096" />
      <stop
         style="stop-color:#4d4d4d;stop-opacity:1;"
         offset="1"
         id="stop4098" />
    </linearGradient>
    <linearGradient
       id="linearGradient4014">
      <stop
         style="stop-color:#a0a0a0;stop-opacity:1;"
         offset="0"
         id="stop4016" />
      <stop
         style="stop-color:#ffffff;stop-opacity:1;"
         offset="1"
         id="stop4018" />
    </linearGradient>
    <linearGradient
       id="linearGradient4678">
      <stop
         style="stop-color:#e5e5e5;stop-opacity:1;"
         offset="0"
         id="stop4680" />
      <stop
         style="stop-color:#d3cdcd;stop-opacity:1;"
         offset="1"
         id="stop4682" />
    </linearGradient>
    <linearGradient
       id="linearGradient4341">
      <stop
         id="stop4343"
         offset="0"
         style="stop-color:#333333;stop-opacity:1;" />
      <stop
         id="stop4345"
         offset="1"
         style="stop-color:#484848;stop-opacity:1;" />
    </linearGradient>
    <linearGradient
       id="linearGradient4696-5">
      <stop
         id="stop4698-6"
         offset="0"
         style="stop-color:#ffb638;stop-opacity:1;" />
      <stop
         id="stop4700-2"
         offset="1"
         style="stop-color:#f0ae26;stop-opacity:1;" />
    </linearGradient>
    <linearGradient
       id="linearGradient4702-3">
      <stop
         id="stop4704-1"
         offset="0"
         style="stop-color:#e34646;stop-opacity:1;" />
      <stop
         id="stop4706-8"
         offset="1"
         style="stop-color:#ffbf2d;stop-opacity:1;" />
    </linearGradient>
    <color-profile
       name="Artifex-PS-CMYK-Profile"
       xlink:href="/usr/share/color/icc/ghostscript/ps_cmyk.icc"
       id="color-profile2657" />
    <clipPath
       id="clipPath4501"
       clipPathUnits="userSpaceOnUse">
      <path
         style="clip-rule:evenodd"
         inkscape:connector-curvature="0"
         id="path4499"
         d="M 0,0 H 124.992 V 144 H 0 Z" />
    </clipPath>
    <clipPath
       id="clipPath4525"
       clipPathUnits="userSpaceOnUse">
      <path
         inkscape:connector-curvature="0"
         id="path4523"
         d="M 0,0 H 100 V 125 H 0 Z" />
    </clipPath>
    <clipPath
       id="clipPath4545"
       clipPathUnits="userSpaceOnUse">
      <path
         inkscape:connector-curvature="0"
         id="path4543"
         d="M 0,0 H 100 V 125 H 0 Z" />
    </clipPath>
    <clipPath
       id="clipPath4561"
       clipPathUnits="userSpaceOnUse">
      <path
         inkscape:connector-curvature="0"
         id="path4559"
         d="M 0,0 H 100 V 125 H 0 Z" />
    </clipPath>
    <clipPath
       id="clipPath4577"
       clipPathUnits="userSpaceOnUse">
      <path
         inkscape:connector-curvature="0"
         id="path4575"
         d="M 0,0 H 100 V 125 H 0 Z" />
    </clipPath>
    <clipPath
       id="clipPath4593"
       clipPathUnits="userSpaceOnUse">
      <path
         inkscape:connector-curvature="0"
         id="path4591"
         d="M 0,0 H 100 V 125 H 0 Z" />
    </clipPath>
    <clipPath
       id="clipPath4609"
       clipPathUnits="userSpaceOnUse">
      <path
         inkscape:connector-curvature="0"
         id="path4607"
         d="M 0,0 H 100 V 125 H 0 Z" />
    </clipPath>
    <clipPath
       id="clipPath4625"
       clipPathUnits="userSpaceOnUse">
      <path
         inkscape:connector-curvature="0"
         id="path4623"
         d="M 0,0 H 100 V 125 H 0 Z" />
    </clipPath>
    <clipPath
       id="clipPath4641"
       clipPathUnits="userSpaceOnUse">
      <path
         inkscape:connector-curvature="0"
         id="path4639"
         d="M 0,0 H 100 V 125 H 0 Z" />
    </clipPath>
    <clipPath
       id="clipPath4657"
       clipPathUnits="userSpaceOnUse">
      <path
         inkscape:connector-curvature="0"
         id="path4655"
         d="M 0,0 H 100 V 125 H 0 Z" />
    </clipPath>
    <clipPath
       id="clipPath4673"
       clipPathUnits="userSpaceOnUse">
      <path
         inkscape:connector-curvature="0"
         id="path4671"
         d="M 0,0 H 100 V 125 H 0 Z" />
    </clipPath>
    <style
       id="style3894"
       type="text/css"><![CDATA[
    line, polyline, path, rect, circle {
      fill: none;
      stroke: #000000;
      stroke-linecap: round;
      stroke-linejoin: round;
      stroke-miterlimit: 10.00;
    }
  ]]></style>
    <clipPath
       id="cpNzMuMDYyM3w1NDYuMzIzfDM5My4wNzJ8MzEuMDU2Nw==">
      <rect
         id="rect3902"
         height="362.02"
         width="473.26"
         y="31.06"
         x="73.06" />
    </clipPath>
    <clipPath
       id="cpMHw3MDguNjYxfDUwMy40MjV8MA==">
      <rect
         id="rect3995"
         height="503.43"
         width="708.66"
         y="0.00"
         x="0.00" />
    </clipPath>
    <marker
       inkscape:stockid="Arrow2Send"
       orient="auto"
       refY="0"
       refX="0"
       id="Arrow2Send-3-3"
       style="overflow:visible"
       inkscape:isstock="true">
      <path
         inkscape:connector-curvature="0"
         id="path6389-4-7"
         style="fill:#ffbf2d;fill-opacity:1;fill-rule:evenodd;stroke:#ffbf2d;stroke-width:0.625;stroke-linejoin:round;stroke-opacity:1"
         d="M 8.7185878,4.0337352 -2.2072895,0.01601326 8.7185884,-4.0017078 c -1.7454984,2.3720609 -1.7354408,5.6174519 -6e-7,8.035443 z"
         transform="matrix(-0.3,0,0,-0.3,0.69,0)" />
    </marker>
    <marker
       inkscape:stockid="Arrow2Send"
       orient="auto"
       refY="0"
       refX="0"
       id="Arrow2Send-3-3-6"
       style="overflow:visible"
       inkscape:isstock="true">
      <path
         inkscape:connector-curvature="0"
         id="path6389-4-7-3"
         style="fill:#ffbf2d;fill-opacity:1;fill-rule:evenodd;stroke:#ffbf2d;stroke-width:0.625;stroke-linejoin:round;stroke-opacity:1"
         d="M 8.7185878,4.0337352 -2.2072895,0.01601326 8.7185884,-4.0017078 c -1.7454984,2.3720609 -1.7354408,5.6174519 -6e-7,8.035443 z"
         transform="matrix(-0.3,0,0,-0.3,0.69,0)" />
    </marker>
    <inkscape:path-effect
       effect="bspline"
       id="path-effect10907-2"
       is_visible="true"
       weight="33.333333"
       steps="2"
       helper_size="0"
       apply_no_weight="true"
       apply_with_weight="true"
       only_selected="false" />
    <inkscape:path-effect
       effect="bspline"
       id="path-effect10907-7"
       is_visible="true"
       weight="33.333333"
       steps="2"
       helper_size="0"
       apply_no_weight="true"
       apply_with_weight="true"
       only_selected="false" />
    <inkscape:path-effect
       effect="bspline"
       id="path-effect10907-1"
       is_visible="true"
       weight="33.333333"
       steps="2"
       helper_size="0"
       apply_no_weight="true"
       apply_with_weight="true"
       only_selected="false" />
  </defs>
  <sodipodi:namedview
     id="base"
     pagecolor="#ffffff"
     bordercolor="#f70bff"
     borderopacity="1"
     inkscape:pageopacity="0.0"
     inkscape:pageshadow="2"
     inkscape:zoom="0.49497475"
     inkscape:cx="847.09768"
     inkscape:cy="628.75069"
     inkscape:document-units="px"
     inkscape:current-layer="layer1"
     showgrid="false"
     units="px"
     borderlayer="true"
     inkscape:showpageshadow="false"
     inkscape:pagecheckerboard="true"
     inkscape:window-width="1920"
     inkscape:window-height="951"
     inkscape:window-x="0"
     inkscape:window-y="55"
     inkscape:window-maximized="1"
     showguides="false" />
  <metadata
     id="metadata5">
    <rdf:RDF>
      <cc:Work
         rdf:about="">
        <dc:format>image/svg+xml</dc:format>
        <dc:type
           rdf:resource="http://purl.org/dc/dcmitype/StillImage" />
        <dc:title></dc:title>
        <cc:license
           rdf:resource="http://creativecommons.org/licenses/by-sa/4.0/" />
      </cc:Work>
      <cc:License
         rdf:about="http://creativecommons.org/licenses/by-sa/4.0/">
        <cc:permits
           rdf:resource="http://creativecommons.org/ns#Reproduction" />
        <cc:permits
           rdf:resource="http://creativecommons.org/ns#Distribution" />
        <cc:requires
           rdf:resource="http://creativecommons.org/ns#Notice" />
        <cc:requires
           rdf:resource="http://creativecommons.org/ns#Attribution" />
        <cc:permits
           rdf:resource="http://creativecommons.org/ns#DerivativeWorks" />
        <cc:requires
           rdf:resource="http://creativecommons.org/ns#ShareAlike" />
      </cc:License>
    </rdf:RDF>
  </metadata>
  <g
     inkscape:label="Layer 1"
     inkscape:groupmode="layer"
     id="layer1"
     transform="translate(0,-11.249975)">
    <rect
       style="color:#000000;clip-rule:nonzero;display:inline;overflow:visible;visibility:visible;opacity:1;isolation:auto;mix-blend-mode:normal;color-interpolation:sRGB;color-interpolation-filters:linearRGB;solid-color:#000000;solid-opacity:1;vector-effect:none;fill:#232323;fill-opacity:1;fill-rule:nonzero;stroke:none;stroke-width:0.3055087;stroke-linecap:round;stroke-linejoin:round;stroke-miterlimit:4;stroke-dasharray:none;stroke-dashoffset:0;stroke-opacity:1;color-rendering:auto;image-rendering:auto;shape-rendering:auto;text-rendering:auto;enable-background:accumulate"
       id="rect2926"
       width="512.95203"
       height="292.72192"
       x="-2.0354033"
       y="8.4516382" />
    <text
       xml:space="preserve"
       style="font-style:normal;font-variant:normal;font-weight:normal;font-stretch:normal;font-size:25.40000153px;line-height:6.61458349px;font-family:'Century Schoolbook L';-inkscape-font-specification:'Century Schoolbook L';letter-spacing:0px;word-spacing:0px;fill:#000000;fill-opacity:1;stroke:none;stroke-width:0.26458335px;stroke-linecap:butt;stroke-linejoin:miter;stroke-opacity:1;"
       x="238.13715"
       y="144.99043"
       id="text9454"><tspan
         sodipodi:role="line"
         id="tspan9452"
         x="238.13715"
         y="154.26672"
         style="font-style:normal;font-variant:normal;font-weight:normal;font-stretch:normal;font-family:'Century Schoolbook L';-inkscape-font-specification:'Century Schoolbook L';stroke-width:0.26458335px;" /></text>
    <flowRoot
       transform="matrix(0.42305208,0,0,0.42305208,-30.171396,-23.993117)"
       xml:space="preserve"
       id="flowRoot17214"
       style="font-style:normal;font-weight:normal;font-size:20px;line-height:25px;font-family:Sans;letter-spacing:0px;word-spacing:0px;fill:#000000;fill-opacity:1;stroke:none;stroke-width:1px;stroke-linecap:butt;stroke-linejoin:miter;stroke-opacity:1"><flowRegion
         id="flowRegion17216"><rect
           id="rect17218"
           width="32.251968"
           height="32.251968"
           x="378.96063"
           y="282.20471"
           style="fill:none;stroke:#000000;stroke-linecap:round;stroke-linejoin:round;stroke-miterlimit:10" /></flowRegion><flowPara
         id="flowPara17220" /></flowRoot>    <text
       xml:space="preserve"
       style="font-style:normal;font-variant:normal;font-weight:normal;font-stretch:normal;font-size:11.99654388px;line-height:0%;font-family:'League Gothic';-inkscape-font-specification:'League Gothic';text-align:start;letter-spacing:0px;word-spacing:0px;text-anchor:start;fill:#ffbf2d;fill-opacity:1;stroke:none;stroke-width:0.29991367;stroke-linecap:butt;stroke-linejoin:miter;stroke-miterlimit:4;stroke-dasharray:none;stroke-opacity:1"
       x="81.530411"
       y="106.104"
       id="text4140-4-6"><tspan
         sodipodi:role="line"
         x="81.530411"
         y="106.104"
         style="font-style:normal;font-variant:normal;font-weight:normal;font-stretch:normal;font-size:34.98992157px;line-height:100%;font-family:'League Gothic';-inkscape-font-specification:'League Gothic';text-align:start;text-anchor:start;fill:#ffbf2d;fill-opacity:1;stroke:none;stroke-width:0.29991367;stroke-miterlimit:4;stroke-dasharray:none;stroke-opacity:1"
         id="tspan14820"><tspan
   style="line-height:100%;text-align:start;text-anchor:start;fill:#ffffff"
   id="tspan14783">guix package</tspan> --manifest</tspan></text>
    <path
       d="m 161.26263,144.54979 q -1.16701,2.00056 -1.74612,3.99238 -0.57034,1.983 -0.57034,4.00113 0,2.00937 0.57034,4.00118 0.57911,1.99178 1.74612,4.00991 h -1.40391 q -1.32494,-2.08832 -1.97425,-4.06259 -0.64932,-1.98302 -0.64932,-3.9485 0,-1.95669 0.64932,-3.93975 0.64931,-1.98301 1.97425,-4.05376 z"
       style="font-style:normal;font-variant:normal;font-weight:normal;font-stretch:normal;font-size:12.50831032px;line-height:15.63538837px;font-family:'DejaVu Sans Mono';-inkscape-font-specification:'DejaVu Sans Mono';letter-spacing:0px;word-spacing:0px;fill:#4d4d4d;fill-opacity:1;stroke:none;stroke-width:0.89850444px;stroke-linecap:butt;stroke-linejoin:miter;stroke-opacity:1"
       id="path26602"
       inkscape:connector-curvature="0" />
    <path
       d="m 172.84491,148.70009 v 1.57942 q -0.69319,-0.40365 -1.39514,-0.60545 -0.70195,-0.20182 -1.43022,-0.20182 -1.09684,0 -1.64083,0.35977 -0.53526,0.35096 -0.53526,1.07927 0,0.65806 0.40363,0.98272 0.40362,0.32467 2.00935,0.63176 l 0.64933,0.12291 q 1.2021,0.22812 1.8163,0.91253 0.62299,0.68439 0.62299,1.78121 0,1.45656 -1.03537,2.28137 -1.03542,0.81602 -2.87805,0.81602 -0.72829,0 -1.52675,-0.1578 -0.79845,-0.14916 -1.72857,-0.45629 v -1.66714 q 0.90378,0.46504 1.72857,0.70195 0.8248,0.22816 1.56186,0.22816 1.07048,0 1.65836,-0.42995 0.58787,-0.43873 0.58787,-1.21966 0,-1.12313 -2.14971,-1.55308 l -0.0703,-0.0166 -0.60544,-0.1229 q -1.39514,-0.27199 -2.03568,-0.91254 -0.64054,-0.6493 -0.64054,-1.76365 0,-1.4127 0.95642,-2.17608 0.95642,-0.77215 2.72885,-0.77215 0.78973,0 1.51798,0.14916 0.72828,0.14033 1.43024,0.42994 z"
       style="font-style:normal;font-variant:normal;font-weight:normal;font-stretch:normal;font-size:12.50831032px;line-height:15.63538837px;font-family:'DejaVu Sans Mono';-inkscape-font-specification:'DejaVu Sans Mono';letter-spacing:0px;word-spacing:0px;fill:#ececec;fill-opacity:1;stroke:none;stroke-width:0.89850444px;stroke-linecap:butt;stroke-linejoin:miter;stroke-opacity:1"
       id="path26604"
       inkscape:connector-curvature="0" />
    <path
       d="m 178.40792,156.94809 v 4.97511 h -1.62328 v -13.56532 h 1.62328 v 1.25475 q 0.40362,-0.72826 1.07048,-1.10558 0.67565,-0.38605 1.55308,-0.38605 1.78121,0 2.79028,1.37759 1.01784,1.37761 1.01784,3.8169 0,2.39542 -1.01784,3.76424 -1.01786,1.36003 -2.79028,1.36003 -0.895,0 -1.57063,-0.3773 -0.66686,-0.38609 -1.05293,-1.11437 z m 4.73822,-3.66772 q 0,-1.87774 -0.59668,-2.83417 -0.5879,-0.95642 -1.75488,-0.95642 -1.17578,0 -1.78123,0.9652 -0.60543,0.95642 -0.60543,2.82539 0,1.86018 0.60543,2.82537 0.60545,0.96517 1.78123,0.96517 1.16698,0 1.75488,-0.95637 0.59668,-0.95645 0.59668,-2.83417 z"
       style="font-style:normal;font-variant:normal;font-weight:normal;font-stretch:normal;font-size:12.50831032px;line-height:15.63538837px;font-family:'DejaVu Sans Mono';-inkscape-font-specification:'DejaVu Sans Mono';letter-spacing:0px;word-spacing:0px;fill:#ececec;fill-opacity:1;stroke:none;stroke-width:0.89850444px;stroke-linecap:butt;stroke-linejoin:miter;stroke-opacity:1"
       id="path26606"
       inkscape:connector-curvature="0" />
    <path
       d="m 195.68482,152.86797 v 0.78972 h -6.99324 v 0.0524 q 0,1.60572 0.83357,2.48315 0.84236,0.87746 2.36911,0.87746 0.77215,0 1.61449,-0.24567 0.84234,-0.2457 1.79878,-0.74583 v 1.60573 q -0.92132,0.37728 -1.78122,0.56156 -0.85113,0.19306 -1.64959,0.19306 -2.29015,0 -3.57997,-1.36882 -1.28987,-1.3776 -1.28987,-3.79058 0,-2.35156 1.26353,-3.75544 1.26351,-1.40391 3.3694,-1.40391 1.87772,0 2.95699,1.27226 1.08802,1.27231 1.08802,3.47469 z m -1.61449,-0.47382 q -0.0351,-1.42146 -0.67561,-2.15853 -0.6318,-0.74584 -1.82511,-0.74584 -1.16702,0 -1.92161,0.77218 -0.75461,0.77212 -0.89499,2.14096 z"
       style="font-style:normal;font-variant:normal;font-weight:normal;font-stretch:normal;font-size:12.50831032px;line-height:15.63538837px;font-family:'DejaVu Sans Mono';-inkscape-font-specification:'DejaVu Sans Mono';letter-spacing:0px;word-spacing:0px;fill:#ececec;fill-opacity:1;stroke:none;stroke-width:0.89850444px;stroke-linecap:butt;stroke-linejoin:miter;stroke-opacity:1"
       id="path26608"
       inkscape:connector-curvature="0" />
    <path
       d="m 206.04747,157.68514 q -0.64932,0.37732 -1.34249,0.56157 -0.68441,0.19301 -1.4039,0.19301 -2.28137,0 -3.57124,-1.36881 -1.28106,-1.36881 -1.28106,-3.79056 0,-2.42174 1.28106,-3.79057 1.28987,-1.36881 3.57124,-1.36881 0.71071,0 1.38633,0.18427 0.67563,0.1843 1.36006,0.57033 v 1.69346 q -0.64057,-0.57031 -1.28986,-0.82478 -0.64054,-0.25448 -1.45653,-0.25448 -1.51801,0 -2.33402,0.98276 -0.81603,0.98272 -0.81603,2.80781 0,1.8163 0.81603,2.80782 0.82479,0.98273 2.33402,0.98273 0.84231,0 1.50918,-0.25447 0.66685,-0.26322 1.23721,-0.80724 z"
       style="font-style:normal;font-variant:normal;font-weight:normal;font-stretch:normal;font-size:12.50831032px;line-height:15.63538837px;font-family:'DejaVu Sans Mono';-inkscape-font-specification:'DejaVu Sans Mono';letter-spacing:0px;word-spacing:0px;fill:#ececec;fill-opacity:1;stroke:none;stroke-width:0.89850444px;stroke-linecap:butt;stroke-linejoin:miter;stroke-opacity:1"
       id="path26610"
       inkscape:connector-curvature="0" />
    <path
       d="m 209.79414,148.35788 h 4.13278 v 8.57266 h 3.20266 v 1.25474 h -8.01984 v -1.25474 h 3.20267 v -7.31791 h -2.51827 z m 2.51827,-3.82566 h 1.61451 v 2.04445 h -1.61451 z"
       style="font-style:normal;font-variant:normal;font-weight:normal;font-stretch:normal;font-size:12.50831032px;line-height:15.63538837px;font-family:'DejaVu Sans Mono';-inkscape-font-specification:'DejaVu Sans Mono';letter-spacing:0px;word-spacing:0px;fill:#ececec;fill-opacity:1;stroke:none;stroke-width:0.89850444px;stroke-linecap:butt;stroke-linejoin:miter;stroke-opacity:1"
       id="path26612"
       inkscape:connector-curvature="0" />
    <path
       d="m 227.68526,144.53222 v 1.34251 h -1.83385 q -0.86867,0 -1.21087,0.35975 -0.33343,0.35095 -0.33343,1.25473 v 0.86867 h 3.37817 v 1.25475 h -3.37817 v 8.57265 h -1.61451 v -8.57265 h -2.62354 v -1.25475 h 2.62354 v -0.68438 q 0,-1.61449 0.73707,-2.3779 0.7458,-0.76338 2.31646,-0.76338 z"
       style="font-style:normal;font-variant:normal;font-weight:normal;font-stretch:normal;font-size:12.50831032px;line-height:15.63538837px;font-family:'DejaVu Sans Mono';-inkscape-font-specification:'DejaVu Sans Mono';letter-spacing:0px;word-spacing:0px;fill:#ececec;fill-opacity:1;stroke:none;stroke-width:0.89850444px;stroke-linecap:butt;stroke-linejoin:miter;stroke-opacity:1"
       id="path26614"
       inkscape:connector-curvature="0" />
    <path
       d="m 231.41442,148.35788 h 4.13277 v 8.57266 h 3.20267 v 1.25474 h -8.01985 v -1.25474 h 3.20268 v -7.31791 h -2.51827 z m 2.51827,-3.82566 h 1.6145 v 2.04445 h -1.6145 z"
       style="font-style:normal;font-variant:normal;font-weight:normal;font-stretch:normal;font-size:12.50831032px;line-height:15.63538837px;font-family:'DejaVu Sans Mono';-inkscape-font-specification:'DejaVu Sans Mono';letter-spacing:0px;word-spacing:0px;fill:#ececec;fill-opacity:1;stroke:none;stroke-width:0.89850444px;stroke-linecap:butt;stroke-linejoin:miter;stroke-opacity:1"
       id="path26616"
       inkscape:connector-curvature="0" />
    <path
       d="m 249.28799,157.68514 q -0.6493,0.37732 -1.34249,0.56157 -0.68441,0.19301 -1.40392,0.19301 -2.28136,0 -3.5712,-1.36881 -1.28107,-1.36881 -1.28107,-3.79056 0,-2.42174 1.28107,-3.79057 1.28984,-1.36881 3.5712,-1.36881 0.71074,0 1.38636,0.18427 0.67563,0.1843 1.36005,0.57033 v 1.69346 q -0.64054,-0.57031 -1.28987,-0.82478 -0.64052,-0.25448 -1.45654,-0.25448 -1.51798,0 -2.33401,0.98276 -0.81604,0.98272 -0.81604,2.80781 0,1.8163 0.81604,2.80782 0.82481,0.98273 2.33401,0.98273 0.84233,0 1.50921,-0.25447 0.66686,-0.26322 1.2372,-0.80724 z"
       style="font-style:normal;font-variant:normal;font-weight:normal;font-stretch:normal;font-size:12.50831032px;line-height:15.63538837px;font-family:'DejaVu Sans Mono';-inkscape-font-specification:'DejaVu Sans Mono';letter-spacing:0px;word-spacing:0px;fill:#ececec;fill-opacity:1;stroke:none;stroke-width:0.89850444px;stroke-linecap:butt;stroke-linejoin:miter;stroke-opacity:1"
       id="path26618"
       inkscape:connector-curvature="0" />
    <path
       d="m 256.94809,153.24526 h -0.53525 q -1.41269,0 -2.1322,0.50014 -0.71071,0.49139 -0.71071,1.47412 0,0.88622 0.53522,1.37759 0.53526,0.49136 1.48288,0.49136 1.33373,0 2.09711,-0.92132 0.76337,-0.93008 0.77215,-2.56214 v -0.35972 z m 3.13246,-0.66685 v 5.60687 h -1.62326 v -1.45655 q -0.51769,0.87744 -1.30739,1.29862 -0.78093,0.41237 -1.90406,0.41237 -1.50043,0 -2.39542,-0.84231 -0.895,-0.85115 -0.895,-2.2726 0,-1.6408 1.09681,-2.49196 1.10558,-0.8511 3.23777,-0.8511 h 2.16729 v -0.25449 q -0.008,-1.17578 -0.59665,-1.70223 -0.58791,-0.53526 -1.87774,-0.53526 -0.82481,0 -1.66715,0.2369 -0.84235,0.23693 -1.64084,0.69319 v -1.61446 q 0.89502,-0.34221 1.71103,-0.50891 0.82481,-0.17546 1.59696,-0.17546 1.21966,0 2.07952,0.35979 0.86868,0.35974 1.40394,1.07924 0.33341,0.43874 0.47381,1.08804 0.14034,0.64053 0.14034,1.93037 z"
       style="font-style:normal;font-variant:normal;font-weight:normal;font-stretch:normal;font-size:12.50831032px;line-height:15.63538837px;font-family:'DejaVu Sans Mono';-inkscape-font-specification:'DejaVu Sans Mono';letter-spacing:0px;word-spacing:0px;fill:#ececec;fill-opacity:1;stroke:none;stroke-width:0.89850444px;stroke-linecap:butt;stroke-linejoin:miter;stroke-opacity:1"
       id="path26620"
       inkscape:connector-curvature="0" />
    <path
       d="m 266.98607,145.5676 v 2.79028 h 3.66772 v 1.25475 h -3.66772 v 5.33489 q 0,1.08802 0.41241,1.51797 0.41238,0.42994 1.43898,0.42994 h 1.81633 v 1.28985 h -1.97427 q -1.81632,0 -2.56212,-0.72829 -0.74583,-0.72826 -0.74583,-2.50947 v -5.33489 H 262.748 v -1.25475 h 2.62357 v -2.79028 z"
       style="font-style:normal;font-variant:normal;font-weight:normal;font-stretch:normal;font-size:12.50831032px;line-height:15.63538837px;font-family:'DejaVu Sans Mono';-inkscape-font-specification:'DejaVu Sans Mono';letter-spacing:0px;word-spacing:0px;fill:#ececec;fill-opacity:1;stroke:none;stroke-width:0.89850444px;stroke-linecap:butt;stroke-linejoin:miter;stroke-opacity:1"
       id="path26622"
       inkscape:connector-curvature="0" />
    <path
       d="m 274.65493,148.35788 h 4.1328 v 8.57266 h 3.20267 v 1.25474 h -8.01985 v -1.25474 h 3.20267 v -7.31791 h -2.51829 z m 2.51829,-3.82566 h 1.61451 v 2.04445 h -1.61451 z"
       style="font-style:normal;font-variant:normal;font-weight:normal;font-stretch:normal;font-size:12.50831032px;line-height:15.63538837px;font-family:'DejaVu Sans Mono';-inkscape-font-specification:'DejaVu Sans Mono';letter-spacing:0px;word-spacing:0px;fill:#ececec;fill-opacity:1;stroke:none;stroke-width:0.89850444px;stroke-linecap:butt;stroke-linejoin:miter;stroke-opacity:1"
       id="path26624"
       inkscape:connector-curvature="0" />
    <path
       d="m 288.62387,149.48978 q -1.22841,0 -1.86017,0.95642 -0.63176,0.95643 -0.63176,2.83417 0,1.86895 0.63176,2.83417 0.63176,0.95637 1.86017,0.95637 1.2372,0 1.86896,-0.95637 0.63176,-0.96522 0.63176,-2.83417 0,-1.87774 -0.63176,-2.83417 -0.63176,-0.95642 -1.86896,-0.95642 z m 0,-1.36881 q 2.04444,0 3.12372,1.32493 1.08801,1.32496 1.08801,3.83447 0,2.51826 -1.07923,3.84322 -1.07927,1.31613 -3.1325,1.31613 -2.04445,0 -3.12369,-1.31613 -1.07927,-1.32496 -1.07927,-3.84322 0,-2.50951 1.07927,-3.83447 1.07924,-1.32493 3.12369,-1.32493 z"
       style="font-style:normal;font-variant:normal;font-weight:normal;font-stretch:normal;font-size:12.50831032px;line-height:15.63538837px;font-family:'DejaVu Sans Mono';-inkscape-font-specification:'DejaVu Sans Mono';letter-spacing:0px;word-spacing:0px;fill:#ececec;fill-opacity:1;stroke:none;stroke-width:0.89850444px;stroke-linecap:butt;stroke-linejoin:miter;stroke-opacity:1"
       id="path26626"
       inkscape:connector-curvature="0" />
    <path
       d="m 303.2509,152.09583 v 6.08945 h -1.62329 v -6.08945 q 0,-1.32497 -0.46504,-1.94794 -0.46504,-0.62299 -1.45657,-0.62299 -1.13189,0 -1.74611,0.80723 -0.60544,0.7985 -0.60544,2.29893 v 5.55422 h -1.61449 v -9.8274 h 1.61449 v 1.47413 q 0.42995,-0.84236 1.16702,-1.2723 0.73704,-0.43874 1.74611,-0.43874 1.50044,0 2.23748,0.99153 0.74584,0.98272 0.74584,2.98333 z"
       style="font-style:normal;font-variant:normal;font-weight:normal;font-stretch:normal;font-size:12.50831032px;line-height:15.63538837px;font-family:'DejaVu Sans Mono';-inkscape-font-specification:'DejaVu Sans Mono';letter-spacing:0px;word-spacing:0px;fill:#ececec;fill-opacity:1;stroke:none;stroke-width:0.89850444px;stroke-linecap:butt;stroke-linejoin:miter;stroke-opacity:1"
       id="path26628"
       inkscape:connector-curvature="0" />
    <path
       d="m 313.37663,148.70009 v 1.57942 q -0.6932,-0.40365 -1.39514,-0.60545 -0.70196,-0.20182 -1.43025,-0.20182 -1.09682,0 -1.64081,0.35977 -0.53526,0.35096 -0.53526,1.07927 0,0.65806 0.40363,0.98272 0.40365,0.32467 2.00936,0.63176 l 0.6493,0.12291 q 1.2021,0.22812 1.81632,0.91253 0.62299,0.68439 0.62299,1.78121 0,1.45656 -1.03537,2.28137 -1.03539,0.81602 -2.87804,0.81602 -0.7283,0 -1.52676,-0.1578 -0.79846,-0.14916 -1.72857,-0.45629 v -1.66714 q 0.90376,0.46504 1.72857,0.70195 0.8248,0.22816 1.56186,0.22816 1.07049,0 1.65837,-0.42995 0.58788,-0.43873 0.58788,-1.21966 0,-1.12313 -2.14972,-1.55308 l -0.0702,-0.0166 -0.60545,-0.1229 q -1.39513,-0.27199 -2.03564,-0.91254 -0.64056,-0.6493 -0.64056,-1.76365 0,-1.4127 0.95643,-2.17608 0.95639,-0.77215 2.72884,-0.77215 0.7897,0 1.518,0.14916 0.72826,0.14033 1.43025,0.42994 z"
       style="font-style:normal;font-variant:normal;font-weight:normal;font-stretch:normal;font-size:12.50831032px;line-height:15.63538837px;font-family:'DejaVu Sans Mono';-inkscape-font-specification:'DejaVu Sans Mono';letter-spacing:0px;word-spacing:0px;fill:#ececec;fill-opacity:1;stroke:none;stroke-width:0.89850444px;stroke-linecap:butt;stroke-linejoin:miter;stroke-opacity:1"
       id="path26630"
       inkscape:connector-curvature="0" />
    <path
       d="m 318.77291,152.5433 h 4.57147 v 1.43902 h -4.57147 z"
       style="font-style:normal;font-variant:normal;font-weight:normal;font-stretch:normal;font-size:12.50831032px;line-height:15.63538837px;font-family:'DejaVu Sans Mono';-inkscape-font-specification:'DejaVu Sans Mono';letter-spacing:0px;word-spacing:0px;fill:#ececec;fill-opacity:1;stroke:none;stroke-width:0.89850444px;stroke-linecap:butt;stroke-linejoin:miter;stroke-opacity:1"
       id="path26632"
       inkscape:connector-curvature="0" />
    <path
       d="m 327.23148,149.75304 v -1.59696 l 9.27462,3.6677 v 1.45659 l -9.27462,3.66772 v -1.60573 l 7.4583,-2.7815 z"
       style="font-style:normal;font-variant:normal;font-weight:normal;font-stretch:normal;font-size:12.50831032px;line-height:15.63538837px;font-family:'DejaVu Sans Mono';-inkscape-font-specification:'DejaVu Sans Mono';letter-spacing:0px;word-spacing:0px;fill:#ececec;fill-opacity:1;stroke:none;stroke-width:0.89850444px;stroke-linecap:butt;stroke-linejoin:miter;stroke-opacity:1"
       id="path26634"
       inkscape:connector-curvature="0" />
    <path
       d="m 343.201,149.3582 q 0.29832,-0.63179 0.7546,-0.93011 0.46504,-0.30709 1.11436,-0.30709 1.18455,0 1.66715,0.9213 0.49136,0.91255 0.49136,3.44838 v 5.69462 h -1.4741 v -5.62442 q 0,-2.07956 -0.23694,-2.57971 -0.22811,-0.50892 -0.84231,-0.50892 -0.70198,0 -0.9652,0.54403 -0.25449,0.53524 -0.25449,2.5446 v 5.62442 h -1.4741 v -5.62442 q 0,-2.10587 -0.25448,-2.59723 -0.2457,-0.4914 -0.89499,-0.4914 -0.64053,0 -0.89498,0.54403 -0.24572,0.53524 -0.24572,2.5446 v 5.62442 h -1.46531 v -9.82741 h 1.46531 v 0.84235 q 0.28958,-0.52646 0.71955,-0.79847 0.43869,-0.2808 0.99148,-0.2808 0.66687,0 1.10559,0.30709 0.44748,0.30714 0.69318,0.93012 z"
       style="font-style:normal;font-variant:normal;font-weight:normal;font-stretch:normal;font-size:12.50831032px;line-height:15.63538837px;font-family:'DejaVu Sans Mono';-inkscape-font-specification:'DejaVu Sans Mono';letter-spacing:0px;word-spacing:0px;fill:#ececec;fill-opacity:1;stroke:none;stroke-width:0.89850444px;stroke-linecap:butt;stroke-linejoin:miter;stroke-opacity:1"
       id="path26636"
       inkscape:connector-curvature="0" />
    <path
       d="m 354.23926,153.24526 h -0.53523 q -1.41269,0 -2.1322,0.50014 -0.71073,0.49139 -0.71073,1.47412 0,0.88622 0.53524,1.37759 0.53526,0.49136 1.48289,0.49136 1.33373,0 2.09711,-0.92132 0.76335,-0.93008 0.77214,-2.56214 v -0.35972 z m 3.13249,-0.66685 v 5.60687 h -1.62327 v -1.45655 q -0.51767,0.87744 -1.30741,1.29862 -0.78092,0.41237 -1.90405,0.41237 -1.50044,0 -2.39544,-0.84231 -0.89498,-0.85115 -0.89498,-2.2726 0,-1.6408 1.09683,-2.49196 1.10556,-0.8511 3.23777,-0.8511 h 2.16728 v -0.25449 q -0.009,-1.17578 -0.59665,-1.70223 -0.5879,-0.53526 -1.87772,-0.53526 -0.82484,0 -1.66716,0.2369 -0.84237,0.23693 -1.64084,0.69319 v -1.61446 q 0.89499,-0.34221 1.71101,-0.50891 0.8248,-0.17546 1.59699,-0.17546 1.21962,0 2.07951,0.35979 0.86867,0.35974 1.40394,1.07924 0.3334,0.43874 0.47378,1.08804 0.14033,0.64053 0.14033,1.93037 z"
       style="font-style:normal;font-variant:normal;font-weight:normal;font-stretch:normal;font-size:12.50831032px;line-height:15.63538837px;font-family:'DejaVu Sans Mono';-inkscape-font-specification:'DejaVu Sans Mono';letter-spacing:0px;word-spacing:0px;fill:#ececec;fill-opacity:1;stroke:none;stroke-width:0.89850444px;stroke-linecap:butt;stroke-linejoin:miter;stroke-opacity:1"
       id="path26638"
       inkscape:connector-curvature="0" />
    <path
       d="m 368.11168,152.09583 v 6.08945 h -1.62325 v -6.08945 q 0,-1.32497 -0.46503,-1.94794 -0.46509,-0.62299 -1.45658,-0.62299 -1.13191,0 -1.74613,0.80723 -0.60545,0.7985 -0.60545,2.29893 v 5.55422 h -1.61447 v -9.8274 h 1.61447 v 1.47413 q 0.42996,-0.84236 1.16704,-1.2723 0.73704,-0.43874 1.74608,-0.43874 1.50045,0 2.23753,0.99153 0.74579,0.98272 0.74579,2.98333 z"
       style="font-style:normal;font-variant:normal;font-weight:normal;font-stretch:normal;font-size:12.50831032px;line-height:15.63538837px;font-family:'DejaVu Sans Mono';-inkscape-font-specification:'DejaVu Sans Mono';letter-spacing:0px;word-spacing:0px;fill:#ececec;fill-opacity:1;stroke:none;stroke-width:0.89850444px;stroke-linecap:butt;stroke-linejoin:miter;stroke-opacity:1"
       id="path26640"
       inkscape:connector-curvature="0" />
    <path
       d="m 371.94613,148.35788 h 4.13277 v 8.57266 h 3.20267 v 1.25474 h -8.01985 v -1.25474 h 3.20267 v -7.31791 h -2.51826 z m 2.51826,-3.82566 h 1.61451 v 2.04445 h -1.61451 z"
       style="font-style:normal;font-variant:normal;font-weight:normal;font-stretch:normal;font-size:12.50831032px;line-height:15.63538837px;font-family:'DejaVu Sans Mono';-inkscape-font-specification:'DejaVu Sans Mono';letter-spacing:0px;word-spacing:0px;fill:#ececec;fill-opacity:1;stroke:none;stroke-width:0.89850444px;stroke-linecap:butt;stroke-linejoin:miter;stroke-opacity:1"
       id="path26642"
       inkscape:connector-curvature="0" />
    <path
       d="m 389.83725,144.53222 v 1.34251 h -1.83386 q -0.86867,0 -1.2109,0.35975 -0.3334,0.35095 -0.3334,1.25473 v 0.86867 h 3.37816 v 1.25475 h -3.37816 v 8.57265 h -1.61449 v -8.57265 h -2.62358 v -1.25475 h 2.62358 v -0.6844 q 0,-1.61451 0.73703,-2.37788 0.74583,-0.76338 2.31645,-0.76338 z"
       style="font-style:normal;font-variant:normal;font-weight:normal;font-stretch:normal;font-size:12.50831032px;line-height:15.63538837px;font-family:'DejaVu Sans Mono';-inkscape-font-specification:'DejaVu Sans Mono';letter-spacing:0px;word-spacing:0px;fill:#ececec;fill-opacity:1;stroke:none;stroke-width:0.89850444px;stroke-linecap:butt;stroke-linejoin:miter;stroke-opacity:1"
       id="path26644"
       inkscape:connector-curvature="0" />
    <path
       d="m 401.07733,152.86797 v 0.78972 h -6.99324 v 0.0524 q 0,1.60572 0.83358,2.48315 0.84233,0.87746 2.36908,0.87746 0.77217,0 1.61452,-0.24567 0.84234,-0.2457 1.79876,-0.74583 v 1.60573 q -0.92131,0.37728 -1.78122,0.56156 -0.85112,0.19306 -1.64958,0.19306 -2.29014,0 -3.58,-1.36882 -1.28983,-1.3776 -1.28983,-3.79058 0,-2.35156 1.26352,-3.75544 1.26352,-1.40391 3.36938,-1.40391 1.87774,0 2.95701,1.27226 1.08802,1.27231 1.08802,3.47469 z m -1.61449,-0.47382 q -0.0351,-1.42146 -0.67563,-2.15853 -0.63176,-0.74584 -1.82512,-0.74584 -1.16697,0 -1.92159,0.77218 -0.7546,0.77212 -0.89499,2.14096 z"
       style="font-style:normal;font-variant:normal;font-weight:normal;font-stretch:normal;font-size:12.50831032px;line-height:15.63538837px;font-family:'DejaVu Sans Mono';-inkscape-font-specification:'DejaVu Sans Mono';letter-spacing:0px;word-spacing:0px;fill:#ececec;fill-opacity:1;stroke:none;stroke-width:0.89850444px;stroke-linecap:butt;stroke-linejoin:miter;stroke-opacity:1"
       id="path26646"
       inkscape:connector-curvature="0" />
    <path
       d="m 410.66782,148.70009 v 1.57942 q -0.69321,-0.40365 -1.39515,-0.60545 -0.70197,-0.20182 -1.43025,-0.20182 -1.09678,0 -1.6408,0.35977 -0.53526,0.35096 -0.53526,1.07927 0,0.65806 0.40364,0.98272 0.40362,0.32467 2.00935,0.63176 l 0.64928,0.12291 q 1.20213,0.22812 1.81634,0.91253 0.62296,0.68439 0.62296,1.78121 0,1.45656 -1.03538,2.28137 -1.03536,0.81602 -2.87801,0.81602 -0.72826,0 -1.52675,-0.1578 -0.79849,-0.14916 -1.72856,-0.45629 v -1.66714 q 0.90376,0.46504 1.72856,0.70195 0.82478,0.22816 1.56185,0.22816 1.07047,0 1.65837,-0.42995 0.5879,-0.43873 0.5879,-1.21966 0,-1.12313 -2.14976,-1.55308 l -0.0703,-0.0166 -0.60544,-0.1229 q -1.39513,-0.27199 -2.03567,-0.91254 -0.64051,-0.6493 -0.64051,-1.76365 0,-1.4127 0.9564,-2.17608 0.95642,-0.77215 2.72885,-0.77215 0.7897,0 1.51799,0.14916 0.72827,0.14033 1.43022,0.42994 z"
       style="font-style:normal;font-variant:normal;font-weight:normal;font-stretch:normal;font-size:12.50831032px;line-height:15.63538837px;font-family:'DejaVu Sans Mono';-inkscape-font-specification:'DejaVu Sans Mono';letter-spacing:0px;word-spacing:0px;fill:#ececec;fill-opacity:1;stroke:none;stroke-width:0.89850444px;stroke-linecap:butt;stroke-linejoin:miter;stroke-opacity:1"
       id="path26648"
       inkscape:connector-curvature="0" />
    <path
       d="m 418.3279,145.5676 v 2.79028 h 3.66774 v 1.25475 h -3.66774 v 5.33489 q 0,1.08802 0.41243,1.51797 0.41238,0.42994 1.43899,0.42994 h 1.81632 v 1.28985 h -1.97427 q -1.81632,0 -2.56213,-0.72829 -0.74582,-0.72826 -0.74582,-2.50947 v -5.33489 h -2.62357 v -1.25475 h 2.62357 v -2.79028 z"
       style="font-style:normal;font-variant:normal;font-weight:normal;font-stretch:normal;font-size:12.50831032px;line-height:15.63538837px;font-family:'DejaVu Sans Mono';-inkscape-font-specification:'DejaVu Sans Mono';letter-spacing:0px;word-spacing:0px;fill:#ececec;fill-opacity:1;stroke:none;stroke-width:0.89850444px;stroke-linecap:butt;stroke-linejoin:miter;stroke-opacity:1"
       id="path26650"
       inkscape:connector-curvature="0" />
    <path
       d="m 182.8829,167.0124 q -1.16701,2.00056 -1.74612,3.99237 -0.57036,1.98302 -0.57036,4.00115 0,2.00936 0.57036,4.00116 0.57911,1.99177 1.74612,4.00993 h -1.40394 q -1.32491,-2.08832 -1.97422,-4.06258 -0.64933,-1.98302 -0.64933,-3.94851 0,-1.9567 0.64933,-3.93974 0.64931,-1.98302 1.97422,-4.05378 z"
       style="font-style:normal;font-variant:normal;font-weight:normal;font-stretch:normal;font-size:12.50831032px;line-height:15.63538837px;font-family:'DejaVu Sans Mono';-inkscape-font-specification:'DejaVu Sans Mono';letter-spacing:0px;word-spacing:0px;fill:#4d4d4d;fill-opacity:1;stroke:none;stroke-width:0.89850444px;stroke-linecap:butt;stroke-linejoin:miter;stroke-opacity:1"
       id="path26652"
       inkscape:connector-curvature="0" />
    <path
       d="m 191.53449,177.08548 q 0,1.08802 0.39486,1.64081 0.40364,0.55279 1.18456,0.55279 h 1.88649 v 1.36882 h -2.04443 q -1.44779,0 -2.24626,-0.9301 -0.78969,-0.9301 -0.78969,-2.63232 v -8.92364 h -2.58846 v -1.26352 h 4.20293 z"
       style="font-style:normal;font-variant:normal;font-weight:normal;font-stretch:normal;font-size:12.50831032px;line-height:15.63538837px;font-family:'DejaVu Sans Mono';-inkscape-font-specification:'DejaVu Sans Mono';letter-spacing:0px;word-spacing:0px;fill:#ececec;fill-opacity:1;stroke:none;stroke-width:0.89850444px;stroke-linecap:butt;stroke-linejoin:miter;stroke-opacity:1"
       id="path26654"
       inkscape:connector-curvature="0" />
    <path
       d="m 198.98402,170.8205 h 4.13278 v 8.57266 h 3.20265 v 1.25474 h -8.01983 v -1.25474 h 3.20266 v -7.31792 h -2.51826 z m 2.51826,-3.82566 h 1.61452 v 2.04443 h -1.61452 z"
       style="font-style:normal;font-variant:normal;font-weight:normal;font-stretch:normal;font-size:12.50831032px;line-height:15.63538837px;font-family:'DejaVu Sans Mono';-inkscape-font-specification:'DejaVu Sans Mono';letter-spacing:0px;word-spacing:0px;fill:#ececec;fill-opacity:1;stroke:none;stroke-width:0.89850444px;stroke-linecap:butt;stroke-linejoin:miter;stroke-opacity:1"
       id="path26656"
       inkscape:connector-curvature="0" />
    <path
       d="m 216.08543,171.1627 v 1.57942 q -0.69319,-0.40364 -1.39514,-0.60544 -0.70194,-0.20182 -1.43023,-0.20182 -1.09682,0 -1.64084,0.35974 -0.53524,0.35098 -0.53524,1.07924 0,0.6581 0.40363,0.98275 0.40363,0.32466 2.00936,0.63178 l 0.64931,0.12266 q 1.2021,0.22815 1.81631,0.91257 0.623,0.68438 0.623,1.78119 0,1.45657 -1.03538,2.28134 -1.0354,0.81604 -2.87805,0.81604 -0.72828,0 -1.52675,-0.15798 -0.79847,-0.14915 -1.72856,-0.45629 v -1.66713 q 0.90377,0.46504 1.72856,0.70197 0.82481,0.22814 1.56187,0.22814 1.07048,0 1.65837,-0.42994 0.58787,-0.43872 0.58787,-1.21968 0,-1.1231 -2.14973,-1.55306 l -0.0703,-0.0184 -0.60545,-0.12265 q -1.39513,-0.27197 -2.03566,-0.91256 -0.64056,-0.64931 -0.64056,-1.76365 0,-1.41269 0.95643,-2.17607 0.95642,-0.77215 2.72885,-0.77215 0.78971,0 1.51799,0.14916 0.72828,0.14034 1.43025,0.42998 z"
       style="font-style:normal;font-variant:normal;font-weight:normal;font-stretch:normal;font-size:12.50831032px;line-height:15.63538837px;font-family:'DejaVu Sans Mono';-inkscape-font-specification:'DejaVu Sans Mono';letter-spacing:0px;word-spacing:0px;fill:#ececec;fill-opacity:1;stroke:none;stroke-width:0.89850444px;stroke-linecap:butt;stroke-linejoin:miter;stroke-opacity:1"
       id="path26658"
       inkscape:connector-curvature="0" />
    <path
       d="m 223.74555,168.03023 v 2.79027 h 3.66772 v 1.25474 h -3.66772 v 5.3349 q 0,1.08802 0.4124,1.51797 0.41239,0.42994 1.43901,0.42994 h 1.81631 v 1.28985 H 225.439 q -1.81629,0 -2.56214,-0.7283 -0.74582,-0.72826 -0.74582,-2.50946 v -5.3349 h -2.62359 v -1.25474 h 2.62359 v -2.79027 z"
       style="font-style:normal;font-variant:normal;font-weight:normal;font-stretch:normal;font-size:12.50831032px;line-height:15.63538837px;font-family:'DejaVu Sans Mono';-inkscape-font-specification:'DejaVu Sans Mono';letter-spacing:0px;word-spacing:0px;fill:#ececec;fill-opacity:1;stroke:none;stroke-width:0.89850444px;stroke-linecap:butt;stroke-linejoin:miter;stroke-opacity:1"
       id="path26660"
       inkscape:connector-curvature="0" />
    <path
       d="m 247.83142,167.54763 v 4.86983 h -1.52677 v -4.86983 z m -3.36062,0 v 4.86983 h -1.52674 v -4.86983 z"
       style="font-style:normal;font-variant:normal;font-weight:normal;font-stretch:normal;font-size:12.50831032px;line-height:15.63538837px;font-family:'DejaVu Sans Mono';-inkscape-font-specification:'DejaVu Sans Mono';letter-spacing:0px;word-spacing:0px;fill:#ffbf2d;fill-opacity:1;stroke:none;stroke-width:0.89850444px;stroke-linecap:butt;stroke-linejoin:miter;stroke-opacity:1"
       id="path26662"
       inkscape:connector-curvature="0" />
    <path
       d="m 259.32597,171.1627 v 1.57942 q -0.6932,-0.40364 -1.39515,-0.60544 -0.70195,-0.20182 -1.43023,-0.20182 -1.09682,0 -1.64082,0.35974 -0.53526,0.35098 -0.53526,1.07924 0,0.6581 0.40364,0.98275 0.40363,0.32466 2.00935,0.63178 l 0.6493,0.12266 q 1.20211,0.22815 1.81632,0.91257 0.62299,0.68438 0.62299,1.78119 0,1.45657 -1.03538,2.28134 -1.03541,0.81604 -2.87804,0.81604 -0.72826,0 -1.52675,-0.15798 -0.79846,-0.14915 -1.72856,-0.45629 v -1.66713 q 0.90376,0.46504 1.72856,0.70197 0.82481,0.22814 1.56184,0.22814 1.0705,0 1.65838,-0.42994 0.58788,-0.43872 0.58788,-1.21968 0,-1.1231 -2.14971,-1.55306 l -0.0703,-0.0184 -0.60545,-0.12265 q -1.39513,-0.27197 -2.03567,-0.91256 -0.64054,-0.64931 -0.64054,-1.76365 0,-1.41269 0.95643,-2.17607 0.95642,-0.77215 2.72884,-0.77215 0.78971,0 1.518,0.14916 0.72827,0.14034 1.43023,0.42998 z"
       style="font-style:normal;font-variant:normal;font-weight:normal;font-stretch:normal;font-size:12.50831032px;line-height:15.63538837px;font-family:'DejaVu Sans Mono';-inkscape-font-specification:'DejaVu Sans Mono';letter-spacing:0px;word-spacing:0px;fill:#ffbf2d;fill-opacity:1;stroke:none;stroke-width:0.89850444px;stroke-linecap:butt;stroke-linejoin:miter;stroke-opacity:1"
       id="path26664"
       inkscape:connector-curvature="0" />
    <path
       d="m 267.75823,175.70786 h -0.53528 q -1.41268,0 -2.13217,0.50015 -0.71074,0.49138 -0.71074,1.47411 0,0.88623 0.53525,1.3776 0.53523,0.49137 1.48288,0.49137 1.33373,0 2.0971,-0.92132 0.76337,-0.9301 0.77214,-2.56214 v -0.35979 z m 3.13246,-0.66683 v 5.60687 h -1.62328 v -1.45656 q -0.5177,0.87743 -1.30739,1.2986 -0.78093,0.4124 -1.90405,0.4124 -1.50045,0 -2.39544,-0.84234 -0.89498,-0.85111 -0.89498,-2.27258 0,-1.64082 1.09679,-2.49196 1.10558,-0.85111 3.23778,-0.85111 h 2.16729 v -0.25445 q -0.009,-1.17577 -0.59666,-1.70223 -0.58787,-0.53523 -1.87772,-0.53523 -0.82481,0 -1.66715,0.23688 -0.84236,0.23695 -1.64083,0.69317 v -1.61447 q 0.89499,-0.34219 1.71101,-0.50893 0.8248,-0.17545 1.59697,-0.17545 1.21964,0 2.07953,0.35974 0.86868,0.35976 1.40392,1.07924 0.33343,0.43873 0.47382,1.08804 0.14034,0.64052 0.14034,1.93039 z"
       style="font-style:normal;font-variant:normal;font-weight:normal;font-stretch:normal;font-size:12.50831032px;line-height:15.63538837px;font-family:'DejaVu Sans Mono';-inkscape-font-specification:'DejaVu Sans Mono';letter-spacing:0px;word-spacing:0px;fill:#ffbf2d;fill-opacity:1;stroke:none;stroke-width:0.89850444px;stroke-linecap:butt;stroke-linejoin:miter;stroke-opacity:1"
       id="path26666"
       inkscape:connector-curvature="0" />
    <path
       d="m 278.34021,171.82078 q 0.29831,-0.63176 0.75462,-0.93007 0.46504,-0.30709 1.11435,-0.30709 1.18454,0 1.66715,0.9213 0.49136,0.91255 0.49136,3.44838 v 5.6946 h -1.47409 v -5.6244 q 0,-2.07958 -0.23695,-2.57971 -0.2281,-0.50892 -0.84233,-0.50892 -0.70197,0 -0.9652,0.54402 -0.25444,0.53524 -0.25444,2.54461 v 5.6244 h -1.47411 v -5.6244 q 0,-2.1059 -0.25447,-2.59726 -0.24569,-0.49137 -0.89499,-0.49137 -0.64054,0 -0.895,0.54402 -0.24567,0.53524 -0.24567,2.54461 v 5.6244 h -1.46534 v -9.82738 h 1.46534 v 0.84235 q 0.28956,-0.52647 0.7195,-0.79847 0.43873,-0.28076 0.99151,-0.28076 0.66687,0 1.1056,0.30709 0.4475,0.30709 0.69317,0.93008 z"
       style="font-style:normal;font-variant:normal;font-weight:normal;font-stretch:normal;font-size:12.50831032px;line-height:15.63538837px;font-family:'DejaVu Sans Mono';-inkscape-font-specification:'DejaVu Sans Mono';letter-spacing:0px;word-spacing:0px;fill:#ffbf2d;fill-opacity:1;stroke:none;stroke-width:0.89850444px;stroke-linecap:butt;stroke-linejoin:miter;stroke-opacity:1"
       id="path26668"
       inkscape:connector-curvature="0" />
    <path
       d="m 288.60632,168.03023 v 2.79027 h 3.66772 v 1.25474 h -3.66772 v 5.3349 q 0,1.08802 0.4124,1.51797 0.4124,0.42994 1.43903,0.42994 h 1.81629 v 1.28985 h -1.97425 q -1.81631,0 -2.56212,-0.7283 -0.74584,-0.72826 -0.74584,-2.50946 v -5.3349 h -2.62356 v -1.25474 h 2.62356 v -2.79027 z"
       style="font-style:normal;font-variant:normal;font-weight:normal;font-stretch:normal;font-size:12.50831032px;line-height:15.63538837px;font-family:'DejaVu Sans Mono';-inkscape-font-specification:'DejaVu Sans Mono';letter-spacing:0px;word-spacing:0px;fill:#ffbf2d;fill-opacity:1;stroke:none;stroke-width:0.89850444px;stroke-linecap:butt;stroke-linejoin:miter;stroke-opacity:1"
       id="path26670"
       inkscape:connector-curvature="0" />
    <path
       d="m 299.43401,171.95242 q -1.22844,0 -1.8602,0.95639 -0.63174,0.95645 -0.63174,2.83417 0,1.86895 0.63174,2.83413 0.63176,0.95642 1.8602,0.95642 1.2372,0 1.86895,-0.95642 0.63178,-0.96518 0.63178,-2.83413 0,-1.87772 -0.63178,-2.83417 -0.63175,-0.95639 -1.86895,-0.95639 z m 0,-1.36882 q 2.04444,0 3.12371,1.32492 1.08802,1.32494 1.08802,3.83446 0,2.51825 -1.07926,3.84323 -1.07926,1.31613 -3.13247,1.31613 -2.04447,0 -3.12371,-1.31613 -1.07926,-1.32498 -1.07926,-3.84323 0,-2.50952 1.07926,-3.83446 1.07924,-1.32492 3.12371,-1.32492 z"
       style="font-style:normal;font-variant:normal;font-weight:normal;font-stretch:normal;font-size:12.50831032px;line-height:15.63538837px;font-family:'DejaVu Sans Mono';-inkscape-font-specification:'DejaVu Sans Mono';letter-spacing:0px;word-spacing:0px;fill:#ffbf2d;fill-opacity:1;stroke:none;stroke-width:0.89850444px;stroke-linecap:butt;stroke-linejoin:miter;stroke-opacity:1"
       id="path26672"
       inkscape:connector-curvature="0" />
    <path
       d="m 310.24415,171.95242 q -1.22844,0 -1.86018,0.95639 -0.63178,0.95645 -0.63178,2.83417 0,1.86895 0.63178,2.83413 0.63174,0.95642 1.86018,0.95642 1.23718,0 1.86897,-0.95642 0.63174,-0.96518 0.63174,-2.83413 0,-1.87772 -0.63174,-2.83417 -0.63179,-0.95639 -1.86897,-0.95639 z m 0,-1.36882 q 2.04444,0 3.1237,1.32492 1.08802,1.32494 1.08802,3.83446 0,2.51825 -1.07924,3.84323 -1.07925,1.31613 -3.13248,1.31613 -2.04446,0 -3.12371,-1.31613 -1.07926,-1.32498 -1.07926,-3.84323 0,-2.50952 1.07926,-3.83446 1.07925,-1.32492 3.12371,-1.32492 z"
       style="font-style:normal;font-variant:normal;font-weight:normal;font-stretch:normal;font-size:12.50831032px;line-height:15.63538837px;font-family:'DejaVu Sans Mono';-inkscape-font-specification:'DejaVu Sans Mono';letter-spacing:0px;word-spacing:0px;fill:#ffbf2d;fill-opacity:1;stroke:none;stroke-width:0.89850444px;stroke-linecap:butt;stroke-linejoin:miter;stroke-opacity:1"
       id="path26674"
       inkscape:connector-curvature="0" />
    <path
       d="m 321.2561,177.08548 q 0,1.08802 0.39483,1.64081 0.40363,0.55279 1.18455,0.55279 h 1.88652 v 1.36882 h -2.04445 q -1.4478,0 -2.24628,-0.9301 -0.7897,-0.9301 -0.7897,-2.63232 v -8.92364 h -2.58846 v -1.26352 h 4.20299 z"
       style="font-style:normal;font-variant:normal;font-weight:normal;font-stretch:normal;font-size:12.50831032px;line-height:15.63538837px;font-family:'DejaVu Sans Mono';-inkscape-font-specification:'DejaVu Sans Mono';letter-spacing:0px;word-spacing:0px;fill:#ffbf2d;fill-opacity:1;stroke:none;stroke-width:0.89850444px;stroke-linecap:butt;stroke-linejoin:miter;stroke-opacity:1"
       id="path26676"
       inkscape:connector-curvature="0" />
    <path
       d="m 334.99687,171.1627 v 1.57942 q -0.69315,-0.40364 -1.39513,-0.60544 -0.70197,-0.20182 -1.43022,-0.20182 -1.09683,0 -1.64086,0.35974 -0.53521,0.35098 -0.53521,1.07924 0,0.6581 0.40362,0.98275 0.40361,0.32466 2.00936,0.63178 l 0.64931,0.12266 q 1.20208,0.22815 1.8163,0.91257 0.62299,0.68438 0.62299,1.78119 0,1.45657 -1.0354,2.28134 -1.03537,0.81604 -2.87802,0.81604 -0.72828,0 -1.52673,-0.15798 -0.79849,-0.14915 -1.72859,-0.45629 v -1.66713 q 0.90377,0.46504 1.72859,0.70197 0.82479,0.22814 1.56183,0.22814 1.07048,0 1.65839,-0.42994 0.58788,-0.43872 0.58788,-1.21968 0,-1.1231 -2.14974,-1.55306 l -0.0702,-0.0184 -0.60545,-0.12265 q -1.39512,-0.27197 -2.03566,-0.91256 -0.64055,-0.64931 -0.64055,-1.76365 0,-1.41269 0.95642,-2.17607 0.95642,-0.77215 2.72885,-0.77215 0.78969,0 1.51798,0.14916 0.72828,0.14034 1.43022,0.42998 z"
       style="font-style:normal;font-variant:normal;font-weight:normal;font-stretch:normal;font-size:12.50831032px;line-height:15.63538837px;font-family:'DejaVu Sans Mono';-inkscape-font-specification:'DejaVu Sans Mono';letter-spacing:0px;word-spacing:0px;fill:#ffbf2d;fill-opacity:1;stroke:none;stroke-width:0.89850444px;stroke-linecap:butt;stroke-linejoin:miter;stroke-opacity:1"
       id="path26678"
       inkscape:connector-curvature="0" />
    <path
       d="m 345.12259,167.54763 v 4.86983 h -1.52675 v -4.86983 z m -3.36062,0 v 4.86983 h -1.52675 v -4.86983 z"
       style="font-style:normal;font-variant:normal;font-weight:normal;font-stretch:normal;font-size:12.50831032px;line-height:15.63538837px;font-family:'DejaVu Sans Mono';-inkscape-font-specification:'DejaVu Sans Mono';letter-spacing:0px;word-spacing:0px;fill:#ffbf2d;fill-opacity:1;stroke:none;stroke-width:0.89850444px;stroke-linecap:butt;stroke-linejoin:miter;stroke-opacity:1"
       id="path26680"
       inkscape:connector-curvature="0" />
    <path
       d="m 247.83142,190.01025 v 4.86981 h -1.52677 v -4.86981 z m -3.36062,0 v 4.86981 h -1.52674 v -4.86981 z"
       style="font-style:normal;font-variant:normal;font-weight:normal;font-stretch:normal;font-size:12.50831032px;line-height:15.63538837px;font-family:'DejaVu Sans Mono';-inkscape-font-specification:'DejaVu Sans Mono';letter-spacing:0px;word-spacing:0px;fill:#ffbf2d;fill-opacity:1;stroke:none;stroke-width:0.89850444px;stroke-linecap:butt;stroke-linejoin:miter;stroke-opacity:1"
       id="path26682"
       inkscape:connector-curvature="0" />
    <path
       d="m 259.32597,193.6253 v 1.57944 q -0.6932,-0.40364 -1.39515,-0.60545 -0.70195,-0.20183 -1.43023,-0.20183 -1.09682,0 -1.64082,0.35977 -0.53526,0.35099 -0.53526,1.07927 0,0.65807 0.40364,0.98273 0.40363,0.32464 2.00935,0.63176 l 0.6493,0.12292 q 1.20211,0.22815 1.81632,0.91255 0.62299,0.68437 0.62299,1.7812 0,1.45655 -1.03538,2.28137 -1.03541,0.81601 -2.87804,0.81601 -0.72826,0 -1.52675,-0.1578 -0.79846,-0.14916 -1.72856,-0.45626 v -1.66713 q 0.90376,0.46503 1.72856,0.70194 0.82481,0.2281 1.56184,0.2281 1.0705,0 1.65838,-0.42994 0.58788,-0.43873 0.58788,-1.21964 0,-1.12314 -2.14971,-1.55308 l -0.0703,-0.0184 -0.60545,-0.12291 q -1.39513,-0.27197 -2.03567,-0.91252 -0.64054,-0.64932 -0.64054,-1.76367 0,-1.41269 0.95643,-2.17607 0.95642,-0.77215 2.72884,-0.77215 0.78971,0 1.518,0.14916 0.72827,0.14032 1.43023,0.42992 z"
       style="font-style:normal;font-variant:normal;font-weight:normal;font-stretch:normal;font-size:12.50831032px;line-height:15.63538837px;font-family:'DejaVu Sans Mono';-inkscape-font-specification:'DejaVu Sans Mono';letter-spacing:0px;word-spacing:0px;fill:#ffbf2d;fill-opacity:1;stroke:none;stroke-width:0.89850444px;stroke-linecap:butt;stroke-linejoin:miter;stroke-opacity:1"
       id="path26684"
       inkscape:connector-curvature="0" />
    <path
       d="m 266.98607,190.49283 v 2.7903 h 3.66772 v 1.25473 h -3.66772 v 5.33487 q 0,1.08802 0.41241,1.51799 0.41238,0.42994 1.43898,0.42994 h 1.81633 v 1.28984 h -1.97427 q -1.81632,0 -2.56212,-0.72828 -0.74583,-0.72828 -0.74583,-2.50949 v -5.33487 H 262.748 v -1.25473 h 2.62357 v -2.7903 z"
       style="font-style:normal;font-variant:normal;font-weight:normal;font-stretch:normal;font-size:12.50831032px;line-height:15.63538837px;font-family:'DejaVu Sans Mono';-inkscape-font-specification:'DejaVu Sans Mono';letter-spacing:0px;word-spacing:0px;fill:#ffbf2d;fill-opacity:1;stroke:none;stroke-width:0.89850444px;stroke-linecap:butt;stroke-linejoin:miter;stroke-opacity:1"
       id="path26686"
       inkscape:connector-curvature="0" />
    <path
       d="m 278.56835,198.17049 h -0.53523 q -1.41271,0 -2.1322,0.50014 -0.71073,0.49138 -0.71073,1.4741 0,0.88621 0.53525,1.37761 0.53522,0.49134 1.48288,0.49134 1.33371,0 2.09708,-0.92128 0.76341,-0.93011 0.77216,-2.56216 v -0.35973 z m 3.13248,-0.66686 v 5.60687 h -1.62327 v -1.45656 q -0.51769,0.87745 -1.30739,1.29861 -0.78094,0.4124 -1.90407,0.4124 -1.50042,0 -2.39543,-0.84234 -0.89497,-0.8511 -0.89497,-2.27257 0,-1.64083 1.09678,-2.49196 1.10558,-0.8511 3.23779,-0.8511 h 2.16729 v -0.25449 q -0.009,-1.17578 -0.59668,-1.70225 -0.58789,-0.53526 -1.87771,-0.53526 -0.82481,0 -1.66716,0.23693 -0.84233,0.23689 -1.64082,0.69319 v -1.61449 q 0.895,-0.3422 1.71103,-0.50891 0.82481,-0.17546 1.59695,-0.17546 1.21964,0 2.07954,0.35973 0.86867,0.35975 1.40392,1.07928 0.33342,0.43871 0.4738,1.08802 0.14032,0.64054 0.14032,1.93038 z"
       style="font-style:normal;font-variant:normal;font-weight:normal;font-stretch:normal;font-size:12.50831032px;line-height:15.63538837px;font-family:'DejaVu Sans Mono';-inkscape-font-specification:'DejaVu Sans Mono';letter-spacing:0px;word-spacing:0px;fill:#ffbf2d;fill-opacity:1;stroke:none;stroke-width:0.89850444px;stroke-linecap:butt;stroke-linejoin:miter;stroke-opacity:1"
       id="path26688"
       inkscape:connector-curvature="0" />
    <path
       d="m 293.3533,195.31002 q -0.5177,-0.40363 -1.05294,-0.58789 -0.53521,-0.18429 -1.17577,-0.18429 -1.50919,0 -2.30768,0.94765 -0.79847,0.94763 -0.79847,2.73763 v 4.88737 h -1.62328 v -9.82738 h 1.62328 v 1.9216 q 0.40364,-1.04416 1.23719,-1.59695 0.84235,-0.56158 1.9918,-0.56158 0.59666,0 1.11437,0.14916 0.51768,0.14916 0.9915,0.46507 z"
       style="font-style:normal;font-variant:normal;font-weight:normal;font-stretch:normal;font-size:12.50831032px;line-height:15.63538837px;font-family:'DejaVu Sans Mono';-inkscape-font-specification:'DejaVu Sans Mono';letter-spacing:0px;word-spacing:0px;fill:#ffbf2d;fill-opacity:1;stroke:none;stroke-width:0.89850444px;stroke-linecap:butt;stroke-linejoin:miter;stroke-opacity:1"
       id="path26690"
       inkscape:connector-curvature="0" />
    <path
       d="m 301.88208,190.01025 v 4.86981 h -1.52677 v -4.86981 z m -3.36061,0 v 4.86981 h -1.52676 v -4.86981 z"
       style="font-style:normal;font-variant:normal;font-weight:normal;font-stretch:normal;font-size:12.50831032px;line-height:15.63538837px;font-family:'DejaVu Sans Mono';-inkscape-font-specification:'DejaVu Sans Mono';letter-spacing:0px;word-spacing:0px;fill:#ffbf2d;fill-opacity:1;stroke:none;stroke-width:0.89850444px;stroke-linecap:butt;stroke-linejoin:miter;stroke-opacity:1"
       id="path26692"
       inkscape:connector-curvature="0" />
    <path
       d="m 247.83142,212.47284 v 4.86984 h -1.52677 v -4.86984 z m -3.36062,0 v 4.86984 h -1.52674 v -4.86984 z"
       style="font-style:normal;font-variant:normal;font-weight:normal;font-stretch:normal;font-size:12.50831032px;line-height:15.63538837px;font-family:'DejaVu Sans Mono';-inkscape-font-specification:'DejaVu Sans Mono';letter-spacing:0px;word-spacing:0px;fill:#ffbf2d;fill-opacity:1;stroke:none;stroke-width:0.89850444px;stroke-linecap:butt;stroke-linejoin:miter;stroke-opacity:1"
       id="path26694"
       inkscape:connector-curvature="0" />
    <path
       d="m 260.92291,217.77264 q -0.5177,-0.40363 -1.05291,-0.58789 -0.53526,-0.18429 -1.17581,-0.18429 -1.5092,0 -2.30767,0.94766 -0.79849,0.94764 -0.79849,2.73763 v 4.88738 h -1.62326 v -9.82739 h 1.62326 v 1.92158 q 0.40364,-1.04415 1.23721,-1.59691 0.84235,-0.5616 1.99179,-0.5616 0.59669,0 1.11435,0.14915 0.51772,0.14916 0.99153,0.46504 z"
       style="font-style:normal;font-variant:normal;font-weight:normal;font-stretch:normal;font-size:12.50831032px;line-height:15.63538837px;font-family:'DejaVu Sans Mono';-inkscape-font-specification:'DejaVu Sans Mono';letter-spacing:0px;word-spacing:0px;fill:#ffbf2d;fill-opacity:1;stroke:none;stroke-width:0.89850444px;stroke-linecap:butt;stroke-linejoin:miter;stroke-opacity:1"
       id="path26696"
       inkscape:connector-curvature="0" />
    <path
       d="m 264.72225,219.93115 h 4.57148 v 1.439 h -4.57148 z"
       style="font-style:normal;font-variant:normal;font-weight:normal;font-stretch:normal;font-size:12.50831032px;line-height:15.63538837px;font-family:'DejaVu Sans Mono';-inkscape-font-specification:'DejaVu Sans Mono';letter-spacing:0px;word-spacing:0px;fill:#ffbf2d;fill-opacity:1;stroke:none;stroke-width:0.89850444px;stroke-linecap:butt;stroke-linejoin:miter;stroke-opacity:1"
       id="path26698"
       inkscape:connector-curvature="0" />
    <path
       d="m 278.34021,216.74603 q 0.29831,-0.63178 0.75462,-0.93009 0.46504,-0.30713 1.11435,-0.30713 1.18454,0 1.66715,0.92132 0.49136,0.91253 0.49136,3.44835 v 5.69463 h -1.47409 v -5.62444 q 0,-2.07953 -0.23695,-2.57967 -0.2281,-0.50892 -0.84233,-0.50892 -0.70197,0 -0.9652,0.54401 -0.25444,0.53524 -0.25444,2.54458 v 5.62444 h -1.47411 v -5.62444 q 0,-2.10586 -0.25447,-2.59724 -0.24569,-0.49135 -0.89499,-0.49135 -0.64054,0 -0.895,0.54401 -0.24567,0.53524 -0.24567,2.54458 v 5.62444 h -1.46534 v -9.82737 h 1.46534 v 0.84232 q 0.28956,-0.52645 0.7195,-0.79848 0.43873,-0.28076 0.99151,-0.28076 0.66687,0 1.1056,0.30713 0.4475,0.30709 0.69317,0.9301 z"
       style="font-style:normal;font-variant:normal;font-weight:normal;font-stretch:normal;font-size:12.50831032px;line-height:15.63538837px;font-family:'DejaVu Sans Mono';-inkscape-font-specification:'DejaVu Sans Mono';letter-spacing:0px;word-spacing:0px;fill:#ffbf2d;fill-opacity:1;stroke:none;stroke-width:0.89850444px;stroke-linecap:butt;stroke-linejoin:miter;stroke-opacity:1"
       id="path26700"
       inkscape:connector-curvature="0" />
    <path
       d="m 285.46507,215.74574 h 4.13279 v 8.57263 h 3.20266 v 1.25476 h -8.01987 v -1.25476 h 3.2027 v -7.31791 h -2.51828 z m 2.51828,-3.82568 h 1.61451 v 2.04444 h -1.61451 z"
       style="font-style:normal;font-variant:normal;font-weight:normal;font-stretch:normal;font-size:12.50831032px;line-height:15.63538837px;font-family:'DejaVu Sans Mono';-inkscape-font-specification:'DejaVu Sans Mono';letter-spacing:0px;word-spacing:0px;fill:#ffbf2d;fill-opacity:1;stroke:none;stroke-width:0.89850444px;stroke-linecap:butt;stroke-linejoin:miter;stroke-opacity:1"
       id="path26702"
       inkscape:connector-curvature="0" />
    <path
       d="m 303.2509,219.48365 v 6.08948 h -1.62329 v -6.08948 q 0,-1.32495 -0.46504,-1.94793 -0.46504,-0.62299 -1.45657,-0.62299 -1.13189,0 -1.74611,0.80724 -0.60544,0.79847 -0.60544,2.29892 v 5.55424 h -1.61449 v -9.82739 h 1.61449 v 1.4741 q 0.42995,-0.84237 1.16702,-1.27229 0.73704,-0.43874 1.74611,-0.43874 1.50044,0 2.23748,0.99151 0.74584,0.98274 0.74584,2.98333 z"
       style="font-style:normal;font-variant:normal;font-weight:normal;font-stretch:normal;font-size:12.50831032px;line-height:15.63538837px;font-family:'DejaVu Sans Mono';-inkscape-font-specification:'DejaVu Sans Mono';letter-spacing:0px;word-spacing:0px;fill:#ffbf2d;fill-opacity:1;stroke:none;stroke-width:0.89850444px;stroke-linecap:butt;stroke-linejoin:miter;stroke-opacity:1"
       id="path26704"
       inkscape:connector-curvature="0" />
    <path
       d="m 307.08534,215.74574 h 4.13276 v 8.57263 h 3.20269 v 1.25476 h -8.01986 v -1.25476 h 3.20268 v -7.31791 h -2.51827 z m 2.51827,-3.82568 h 1.61449 v 2.04444 h -1.61449 z"
       style="font-style:normal;font-variant:normal;font-weight:normal;font-stretch:normal;font-size:12.50831032px;line-height:15.63538837px;font-family:'DejaVu Sans Mono';-inkscape-font-specification:'DejaVu Sans Mono';letter-spacing:0px;word-spacing:0px;fill:#ffbf2d;fill-opacity:1;stroke:none;stroke-width:0.89850444px;stroke-linecap:butt;stroke-linejoin:miter;stroke-opacity:1"
       id="path26706"
       inkscape:connector-curvature="0" />
    <path
       d="m 321.58076,216.74603 q 0.29831,-0.63178 0.75458,-0.93009 0.46506,-0.30713 1.11435,-0.30713 1.18455,0 1.66716,0.92132 0.49137,0.91253 0.49137,3.44835 v 5.69463 h -1.47412 v -5.62444 q 0,-2.07953 -0.23689,-2.57967 -0.22815,-0.50892 -0.84233,-0.50892 -0.70198,0 -0.96521,0.54401 -0.25447,0.53524 -0.25447,2.54458 v 5.62444 h -1.47411 v -5.62444 q 0,-2.10586 -0.2545,-2.59724 -0.24568,-0.49135 -0.89498,-0.49135 -0.64053,0 -0.89497,0.54401 -0.24572,0.53524 -0.24572,2.54458 v 5.62444 h -1.46534 v -9.82737 h 1.46534 v 0.84232 q 0.28955,-0.52645 0.7195,-0.79848 0.43874,-0.28076 0.99152,-0.28076 0.66688,0 1.10559,0.30713 0.4475,0.30709 0.69318,0.9301 z"
       style="font-style:normal;font-variant:normal;font-weight:normal;font-stretch:normal;font-size:12.50831032px;line-height:15.63538837px;font-family:'DejaVu Sans Mono';-inkscape-font-specification:'DejaVu Sans Mono';letter-spacing:0px;word-spacing:0px;fill:#ffbf2d;fill-opacity:1;stroke:none;stroke-width:0.89850444px;stroke-linecap:butt;stroke-linejoin:miter;stroke-opacity:1"
       id="path26708"
       inkscape:connector-curvature="0" />
    <path
       d="m 332.61899,220.63308 h -0.53523 q -1.41268,0 -2.13217,0.50017 -0.71075,0.49137 -0.71075,1.4741 0,0.88621 0.53525,1.3776 0.53524,0.49135 1.48288,0.49135 1.33371,0 2.09708,-0.92129 0.7634,-0.93011 0.77217,-2.56217 v -0.35972 z m 3.13251,-0.66683 v 5.60688 h -1.62328 v -1.45657 q -0.51772,0.87745 -1.30738,1.29862 -0.78096,0.41241 -1.90408,0.41241 -1.50045,0 -2.39541,-0.84236 -0.895,-0.8511 -0.895,-2.27259 0,-1.64081 1.09681,-2.49192 1.10556,-0.85114 3.23776,-0.85114 h 2.1673 v -0.25445 q -0.009,-1.17577 -0.59666,-1.70223 -0.58791,-0.53525 -1.87775,-0.53525 -0.82479,0 -1.66714,0.23692 -0.84234,0.23691 -1.64083,0.69319 v -1.61453 q 0.895,-0.34217 1.71104,-0.5089 0.82479,-0.17545 1.59693,-0.17545 1.21965,0 2.07956,0.35975 0.86867,0.35974 1.40392,1.07925 0.33341,0.43871 0.47382,1.08803 0.14032,0.64055 0.14032,1.93038 z"
       style="font-style:normal;font-variant:normal;font-weight:normal;font-stretch:normal;font-size:12.50831032px;line-height:15.63538837px;font-family:'DejaVu Sans Mono';-inkscape-font-specification:'DejaVu Sans Mono';letter-spacing:0px;word-spacing:0px;fill:#ffbf2d;fill-opacity:1;stroke:none;stroke-width:0.89850444px;stroke-linecap:butt;stroke-linejoin:miter;stroke-opacity:1"
       id="path26710"
       inkscape:connector-curvature="0" />
    <path
       d="m 342.87635,222.01068 q 0,1.08804 0.39484,1.64085 0.40362,0.55278 1.18455,0.55278 h 1.88652 v 1.36882 h -2.04445 q -1.4478,0 -2.24627,-0.93011 -0.7897,-0.93009 -0.7897,-2.63234 v -8.92362 h -2.58846 v -1.26352 h 4.20297 z"
       style="font-style:normal;font-variant:normal;font-weight:normal;font-stretch:normal;font-size:12.50831032px;line-height:15.63538837px;font-family:'DejaVu Sans Mono';-inkscape-font-specification:'DejaVu Sans Mono';letter-spacing:0px;word-spacing:0px;fill:#ffbf2d;fill-opacity:1;stroke:none;stroke-width:0.89850444px;stroke-linecap:butt;stroke-linejoin:miter;stroke-opacity:1"
       id="path26712"
       inkscape:connector-curvature="0" />
    <path
       d="m 355.93273,212.47284 v 4.86984 H 354.406 v -4.86984 z m -3.36059,0 v 4.86984 h -1.52678 v -4.86984 z"
       style="font-style:normal;font-variant:normal;font-weight:normal;font-stretch:normal;font-size:12.50831032px;line-height:15.63538837px;font-family:'DejaVu Sans Mono';-inkscape-font-specification:'DejaVu Sans Mono';letter-spacing:0px;word-spacing:0px;fill:#ffbf2d;fill-opacity:1;stroke:none;stroke-width:0.89850444px;stroke-linecap:butt;stroke-linejoin:miter;stroke-opacity:1"
       id="path26714"
       inkscape:connector-curvature="0" />
    <path
       d="m 247.83142,234.93548 v 4.86981 h -1.52677 v -4.86981 z m -3.36062,0 v 4.86981 h -1.52674 v -4.86981 z"
       style="font-style:normal;font-variant:normal;font-weight:normal;font-stretch:normal;font-size:12.50831032px;line-height:15.63538837px;font-family:'DejaVu Sans Mono';-inkscape-font-specification:'DejaVu Sans Mono';letter-spacing:0px;word-spacing:0px;fill:#ffbf2d;fill-opacity:1;stroke:none;stroke-width:0.89850444px;stroke-linecap:butt;stroke-linejoin:miter;stroke-opacity:1"
       id="path26716"
       inkscape:connector-curvature="0" />
    <path
       d="m 260.92291,240.23522 q -0.5177,-0.40362 -1.05291,-0.58786 -0.53526,-0.18429 -1.17581,-0.18429 -1.5092,0 -2.30767,0.94764 -0.79849,0.94763 -0.79849,2.73764 v 4.88737 h -1.62326 v -9.82741 h 1.62326 v 1.92161 q 0.40364,-1.04414 1.23721,-1.59696 0.84235,-0.56156 1.99179,-0.56156 0.59669,0 1.11435,0.14916 0.51772,0.14916 0.99153,0.46506 z"
       style="font-style:normal;font-variant:normal;font-weight:normal;font-stretch:normal;font-size:12.50831032px;line-height:15.63538837px;font-family:'DejaVu Sans Mono';-inkscape-font-specification:'DejaVu Sans Mono';letter-spacing:0px;word-spacing:0px;fill:#ffbf2d;fill-opacity:1;stroke:none;stroke-width:0.89850444px;stroke-linecap:butt;stroke-linejoin:miter;stroke-opacity:1"
       id="path26718"
       inkscape:connector-curvature="0" />
    <path
       d="m 264.72225,242.39375 h 4.57148 v 1.43903 h -4.57148 z"
       style="font-style:normal;font-variant:normal;font-weight:normal;font-stretch:normal;font-size:12.50831032px;line-height:15.63538837px;font-family:'DejaVu Sans Mono';-inkscape-font-specification:'DejaVu Sans Mono';letter-spacing:0px;word-spacing:0px;fill:#ffbf2d;fill-opacity:1;stroke:none;stroke-width:0.89850444px;stroke-linecap:butt;stroke-linejoin:miter;stroke-opacity:1"
       id="path26720"
       inkscape:connector-curvature="0" />
    <path
       d="m 282.54317,240.23522 q -0.51766,-0.40362 -1.05293,-0.58786 -0.53523,-0.18429 -1.17577,-0.18429 -1.50921,0 -2.30767,0.94764 -0.79848,0.94763 -0.79848,2.73764 v 4.88737 h -1.62328 v -9.82741 h 1.62328 v 1.92161 q 0.40362,-1.04414 1.2372,-1.59696 0.84232,-0.56156 1.99182,-0.56156 0.59664,0 1.11433,0.14916 0.51767,0.14916 0.9915,0.46506 z"
       style="font-style:normal;font-variant:normal;font-weight:normal;font-stretch:normal;font-size:12.50831032px;line-height:15.63538837px;font-family:'DejaVu Sans Mono';-inkscape-font-specification:'DejaVu Sans Mono';letter-spacing:0px;word-spacing:0px;fill:#ffbf2d;fill-opacity:1;stroke:none;stroke-width:0.89850444px;stroke-linecap:butt;stroke-linejoin:miter;stroke-opacity:1"
       id="path26722"
       inkscape:connector-curvature="0" />
    <path
       d="m 292.52851,247.53559 q -0.64931,0.37728 -1.3425,0.56156 -0.6844,0.19306 -1.4039,0.19306 -2.28138,0 -3.57121,-1.36883 -1.28108,-1.36881 -1.28108,-3.79057 0,-2.42174 1.28108,-3.79054 1.28983,-1.36883 3.57121,-1.36883 0.71072,0 1.38636,0.18427 0.67562,0.18429 1.36004,0.57034 v 1.69346 q -0.64053,-0.57033 -1.28984,-0.8248 -0.64056,-0.25443 -1.45656,-0.25443 -1.51798,0 -2.33402,0.98273 -0.81601,0.98274 -0.81601,2.80781 0,1.81634 0.81601,2.80785 0.82483,0.98274 2.33402,0.98274 0.84234,0 1.50919,-0.25448 0.66687,-0.26323 1.23721,-0.80723 z"
       style="font-style:normal;font-variant:normal;font-weight:normal;font-stretch:normal;font-size:12.50831032px;line-height:15.63538837px;font-family:'DejaVu Sans Mono';-inkscape-font-specification:'DejaVu Sans Mono';letter-spacing:0px;word-spacing:0px;fill:#ffbf2d;fill-opacity:1;stroke:none;stroke-width:0.89850444px;stroke-linecap:butt;stroke-linejoin:miter;stroke-opacity:1"
       id="path26724"
       inkscape:connector-curvature="0" />
    <path
       d="m 300.18861,243.09569 h -0.53525 q -1.41268,0 -2.13218,0.50015 -0.71073,0.4914 -0.71073,1.47411 0,0.88622 0.53523,1.3776 0.53525,0.49137 1.48288,0.49137 1.33374,0 2.09713,-0.92132 0.76335,-0.93009 0.77213,-2.56214 v -0.35979 z m 3.13248,-0.66683 v 5.60687 h -1.62327 v -1.45656 q -0.5177,0.87745 -1.30739,1.29862 -0.78093,0.41241 -1.90408,0.41241 -1.50041,0 -2.39541,-0.84237 -0.89498,-0.85112 -0.89498,-2.27257 0,-1.64082 1.09679,-2.49195 1.10558,-0.85113 3.23778,-0.85113 h 2.16729 v -0.25448 q -0.009,-1.17577 -0.59666,-1.70223 -0.58787,-0.53524 -1.87774,-0.53524 -0.82481,0 -1.66715,0.23688 -0.84234,0.23691 -1.64082,0.69318 v -1.61445 q 0.895,-0.34224 1.71102,-0.50891 0.8248,-0.17546 1.59695,-0.17546 1.21966,0 2.07954,0.35972 0.86867,0.35975 1.40392,1.07926 0.33344,0.43872 0.4738,1.08805 0.14033,0.6405 0.14033,1.93037 z"
       style="font-style:normal;font-variant:normal;font-weight:normal;font-stretch:normal;font-size:12.50831032px;line-height:15.63538837px;font-family:'DejaVu Sans Mono';-inkscape-font-specification:'DejaVu Sans Mono';letter-spacing:0px;word-spacing:0px;fill:#ffbf2d;fill-opacity:1;stroke:none;stroke-width:0.89850444px;stroke-linecap:butt;stroke-linejoin:miter;stroke-opacity:1"
       id="path26726"
       inkscape:connector-curvature="0" />
    <path
       d="m 313.37663,238.55053 v 1.57942 q -0.6932,-0.40364 -1.39514,-0.60544 -0.70196,-0.20179 -1.43025,-0.20179 -1.09682,0 -1.64081,0.35975 -0.53526,0.35094 -0.53526,1.07925 0,0.65809 0.40363,0.98273 0.40365,0.32467 2.00936,0.63177 l 0.6493,0.12266 q 1.2021,0.22811 1.81632,0.91253 0.62299,0.68441 0.62299,1.78123 0,1.45653 -1.03537,2.28135 -1.03539,0.81602 -2.87804,0.81602 -0.7283,0 -1.52676,-0.1578 -0.79846,-0.14916 -1.72857,-0.45629 v -1.66712 q 0.90376,0.46505 1.72857,0.70196 0.8248,0.22814 1.56186,0.22814 1.07049,0 1.65837,-0.42992 0.58788,-0.43875 0.58788,-1.21967 0,-1.12313 -2.14972,-1.55308 l -0.0702,-0.0184 -0.60545,-0.12291 q -1.39513,-0.27197 -2.03564,-0.91252 -0.64056,-0.64932 -0.64056,-1.76368 0,-1.41268 0.95643,-2.17605 0.95639,-0.77215 2.72884,-0.77215 0.7897,0 1.518,0.14916 0.72826,0.14034 1.43025,0.42994 z"
       style="font-style:normal;font-variant:normal;font-weight:normal;font-stretch:normal;font-size:12.50831032px;line-height:15.63538837px;font-family:'DejaVu Sans Mono';-inkscape-font-specification:'DejaVu Sans Mono';letter-spacing:0px;word-spacing:0px;fill:#ffbf2d;fill-opacity:1;stroke:none;stroke-width:0.89850444px;stroke-linecap:butt;stroke-linejoin:miter;stroke-opacity:1"
       id="path26728"
       inkscape:connector-curvature="0" />
    <path
       d="m 323.50235,234.93548 v 4.86981 h -1.52675 v -4.86981 z m -3.36062,0 v 4.86981 h -1.52675 v -4.86981 z"
       style="font-style:normal;font-variant:normal;font-weight:normal;font-stretch:normal;font-size:12.50831032px;line-height:15.63538837px;font-family:'DejaVu Sans Mono';-inkscape-font-specification:'DejaVu Sans Mono';letter-spacing:0px;word-spacing:0px;fill:#ffbf2d;fill-opacity:1;stroke:none;stroke-width:0.89850444px;stroke-linecap:butt;stroke-linejoin:miter;stroke-opacity:1"
       id="path26730"
       inkscape:connector-curvature="0" />
    <path
       d="m 329.51285,234.40023 h 1.40391 q 1.32494,2.07077 1.97425,4.0538 0.64932,1.98302 0.64932,3.93972 0,1.97424 -0.64932,3.95728 -0.64931,1.98303 -1.97425,4.05381 h -1.40391 q 1.167,-2.03568 1.73735,-4.02748 0.5791,-1.9918 0.5791,-3.98361 0,-2.00056 -0.5791,-3.99238 -0.57035,-1.9918 -1.73735,-4.00114 z"
       style="font-style:normal;font-variant:normal;font-weight:normal;font-stretch:normal;font-size:12.50831032px;line-height:15.63538837px;font-family:'DejaVu Sans Mono';-inkscape-font-specification:'DejaVu Sans Mono';letter-spacing:0px;word-spacing:0px;fill:#4d4d4d;fill-opacity:1;stroke:none;stroke-width:0.89850444px;stroke-linecap:butt;stroke-linejoin:miter;stroke-opacity:1"
       id="path26732"
       inkscape:connector-curvature="0" />
    <path
       d="m 340.32298,234.40023 h 1.40391 q 1.32495,2.07077 1.97426,4.0538 0.64932,1.98302 0.64932,3.93972 0,1.97424 -0.64932,3.95728 -0.64931,1.98303 -1.97426,4.05381 h -1.40391 q 1.16701,-2.03568 1.73734,-4.02748 0.57912,-1.9918 0.57912,-3.98361 0,-2.00056 -0.57912,-3.99238 -0.57033,-1.9918 -1.73734,-4.00114 z"
       style="font-style:normal;font-variant:normal;font-weight:normal;font-stretch:normal;font-size:12.50831032px;line-height:15.63538837px;font-family:'DejaVu Sans Mono';-inkscape-font-specification:'DejaVu Sans Mono';letter-spacing:0px;word-spacing:0px;fill:#4d4d4d;fill-opacity:1;stroke:none;stroke-width:0.89850444px;stroke-linecap:butt;stroke-linejoin:miter;stroke-opacity:1"
       id="path26734"
       inkscape:connector-curvature="0" />
  </g>
  <style
     id="style10850"
     type="text/css">
	.st0{opacity:0.15;fill:#292F33;}
	.st1{fill:#FFFFFF;}
</style>
</svg>
