<?xml version="1.0" encoding="UTF-8" standalone="no"?>
<!-- Created with Inkscape (http://www.inkscape.org/) -->

<svg
   xmlns:dc="http://purl.org/dc/elements/1.1/"
   xmlns:cc="http://creativecommons.org/ns#"
   xmlns:rdf="http://www.w3.org/1999/02/22-rdf-syntax-ns#"
   xmlns:svg="http://www.w3.org/2000/svg"
   xmlns="http://www.w3.org/2000/svg"
   xmlns:xlink="http://www.w3.org/1999/xlink"
   xmlns:sodipodi="http://sodipodi.sourceforge.net/DTD/sodipodi-0.dtd"
   xmlns:inkscape="http://www.inkscape.org/namespaces/inkscape"
   width="1920"
   height="1080"
   viewBox="0 0 507.99999 285.75001"
   version="1.1"
   id="svg8"
   inkscape:version="0.92.3 (2405546, 2018-03-11)"
   sodipodi:docname="use-manifest-2.svg">
  <defs
     id="defs2">
    <inkscape:path-effect
       effect="bspline"
       id="path-effect10907"
       is_visible="true"
       weight="33.333333"
       steps="2"
       helper_size="0"
       apply_no_weight="true"
       apply_with_weight="true"
       only_selected="false" />
    <inkscape:perspective
       sodipodi:type="inkscape:persp3d"
       inkscape:vp_x="0 : 142.875 : 1"
       inkscape:vp_y="0 : 1000 : 0"
       inkscape:vp_z="507.99999 : 142.875 : 1"
       inkscape:persp3d-origin="254 : 95.250003 : 1"
       id="perspective9456" />
    <inkscape:path-effect
       effect="bspline"
       id="path-effect4268"
       is_visible="true"
       weight="33.333333"
       steps="2"
       helper_size="0"
       apply_no_weight="true"
       apply_with_weight="true"
       only_selected="false" />
    <linearGradient
       id="linearGradient4094">
      <stop
         style="stop-color:#232323;stop-opacity:1;"
         offset="0"
         id="stop4096" />
      <stop
         style="stop-color:#4d4d4d;stop-opacity:1;"
         offset="1"
         id="stop4098" />
    </linearGradient>
    <linearGradient
       id="linearGradient4014">
      <stop
         style="stop-color:#a0a0a0;stop-opacity:1;"
         offset="0"
         id="stop4016" />
      <stop
         style="stop-color:#ffffff;stop-opacity:1;"
         offset="1"
         id="stop4018" />
    </linearGradient>
    <linearGradient
       id="linearGradient4678">
      <stop
         style="stop-color:#e5e5e5;stop-opacity:1;"
         offset="0"
         id="stop4680" />
      <stop
         style="stop-color:#d3cdcd;stop-opacity:1;"
         offset="1"
         id="stop4682" />
    </linearGradient>
    <linearGradient
       id="linearGradient4341">
      <stop
         id="stop4343"
         offset="0"
         style="stop-color:#333333;stop-opacity:1;" />
      <stop
         id="stop4345"
         offset="1"
         style="stop-color:#484848;stop-opacity:1;" />
    </linearGradient>
    <linearGradient
       id="linearGradient4696-5">
      <stop
         id="stop4698-6"
         offset="0"
         style="stop-color:#ffb638;stop-opacity:1;" />
      <stop
         id="stop4700-2"
         offset="1"
         style="stop-color:#f0ae26;stop-opacity:1;" />
    </linearGradient>
    <linearGradient
       id="linearGradient4702-3">
      <stop
         id="stop4704-1"
         offset="0"
         style="stop-color:#e34646;stop-opacity:1;" />
      <stop
         id="stop4706-8"
         offset="1"
         style="stop-color:#ffbf2d;stop-opacity:1;" />
    </linearGradient>
    <color-profile
       name="Artifex-PS-CMYK-Profile"
       xlink:href="/usr/share/color/icc/ghostscript/ps_cmyk.icc"
       id="color-profile2657" />
    <clipPath
       id="clipPath4501"
       clipPathUnits="userSpaceOnUse">
      <path
         style="clip-rule:evenodd"
         inkscape:connector-curvature="0"
         id="path4499"
         d="M 0,0 H 124.992 V 144 H 0 Z" />
    </clipPath>
    <clipPath
       id="clipPath4525"
       clipPathUnits="userSpaceOnUse">
      <path
         inkscape:connector-curvature="0"
         id="path4523"
         d="M 0,0 H 100 V 125 H 0 Z" />
    </clipPath>
    <clipPath
       id="clipPath4545"
       clipPathUnits="userSpaceOnUse">
      <path
         inkscape:connector-curvature="0"
         id="path4543"
         d="M 0,0 H 100 V 125 H 0 Z" />
    </clipPath>
    <clipPath
       id="clipPath4561"
       clipPathUnits="userSpaceOnUse">
      <path
         inkscape:connector-curvature="0"
         id="path4559"
         d="M 0,0 H 100 V 125 H 0 Z" />
    </clipPath>
    <clipPath
       id="clipPath4577"
       clipPathUnits="userSpaceOnUse">
      <path
         inkscape:connector-curvature="0"
         id="path4575"
         d="M 0,0 H 100 V 125 H 0 Z" />
    </clipPath>
    <clipPath
       id="clipPath4593"
       clipPathUnits="userSpaceOnUse">
      <path
         inkscape:connector-curvature="0"
         id="path4591"
         d="M 0,0 H 100 V 125 H 0 Z" />
    </clipPath>
    <clipPath
       id="clipPath4609"
       clipPathUnits="userSpaceOnUse">
      <path
         inkscape:connector-curvature="0"
         id="path4607"
         d="M 0,0 H 100 V 125 H 0 Z" />
    </clipPath>
    <clipPath
       id="clipPath4625"
       clipPathUnits="userSpaceOnUse">
      <path
         inkscape:connector-curvature="0"
         id="path4623"
         d="M 0,0 H 100 V 125 H 0 Z" />
    </clipPath>
    <clipPath
       id="clipPath4641"
       clipPathUnits="userSpaceOnUse">
      <path
         inkscape:connector-curvature="0"
         id="path4639"
         d="M 0,0 H 100 V 125 H 0 Z" />
    </clipPath>
    <clipPath
       id="clipPath4657"
       clipPathUnits="userSpaceOnUse">
      <path
         inkscape:connector-curvature="0"
         id="path4655"
         d="M 0,0 H 100 V 125 H 0 Z" />
    </clipPath>
    <clipPath
       id="clipPath4673"
       clipPathUnits="userSpaceOnUse">
      <path
         inkscape:connector-curvature="0"
         id="path4671"
         d="M 0,0 H 100 V 125 H 0 Z" />
    </clipPath>
    <style
       id="style3894"
       type="text/css"><![CDATA[
    line, polyline, path, rect, circle {
      fill: none;
      stroke: #000000;
      stroke-linecap: round;
      stroke-linejoin: round;
      stroke-miterlimit: 10.00;
    }
  ]]></style>
    <clipPath
       id="cpNzMuMDYyM3w1NDYuMzIzfDM5My4wNzJ8MzEuMDU2Nw==">
      <rect
         id="rect3902"
         height="362.02"
         width="473.26"
         y="31.06"
         x="73.06" />
    </clipPath>
    <clipPath
       id="cpMHw3MDguNjYxfDUwMy40MjV8MA==">
      <rect
         id="rect3995"
         height="503.43"
         width="708.66"
         y="0.00"
         x="0.00" />
    </clipPath>
    <marker
       inkscape:stockid="Arrow2Send"
       orient="auto"
       refY="0"
       refX="0"
       id="Arrow2Send-3-3"
       style="overflow:visible"
       inkscape:isstock="true">
      <path
         inkscape:connector-curvature="0"
         id="path6389-4-7"
         style="fill:#ffbf2d;fill-opacity:1;fill-rule:evenodd;stroke:#ffbf2d;stroke-width:0.625;stroke-linejoin:round;stroke-opacity:1"
         d="M 8.7185878,4.0337352 -2.2072895,0.01601326 8.7185884,-4.0017078 c -1.7454984,2.3720609 -1.7354408,5.6174519 -6e-7,8.035443 z"
         transform="matrix(-0.3,0,0,-0.3,0.69,0)" />
    </marker>
    <marker
       inkscape:stockid="Arrow2Send"
       orient="auto"
       refY="0"
       refX="0"
       id="Arrow2Send-3-3-6"
       style="overflow:visible"
       inkscape:isstock="true">
      <path
         inkscape:connector-curvature="0"
         id="path6389-4-7-3"
         style="fill:#ffbf2d;fill-opacity:1;fill-rule:evenodd;stroke:#ffbf2d;stroke-width:0.625;stroke-linejoin:round;stroke-opacity:1"
         d="M 8.7185878,4.0337352 -2.2072895,0.01601326 8.7185884,-4.0017078 c -1.7454984,2.3720609 -1.7354408,5.6174519 -6e-7,8.035443 z"
         transform="matrix(-0.3,0,0,-0.3,0.69,0)" />
    </marker>
    <inkscape:path-effect
       effect="bspline"
       id="path-effect10907-2"
       is_visible="true"
       weight="33.333333"
       steps="2"
       helper_size="0"
       apply_no_weight="true"
       apply_with_weight="true"
       only_selected="false" />
    <inkscape:path-effect
       effect="bspline"
       id="path-effect10907-7"
       is_visible="true"
       weight="33.333333"
       steps="2"
       helper_size="0"
       apply_no_weight="true"
       apply_with_weight="true"
       only_selected="false" />
    <inkscape:path-effect
       effect="bspline"
       id="path-effect10907-1"
       is_visible="true"
       weight="33.333333"
       steps="2"
       helper_size="0"
       apply_no_weight="true"
       apply_with_weight="true"
       only_selected="false" />
  </defs>
  <sodipodi:namedview
     id="base"
     pagecolor="#ffffff"
     bordercolor="#f70bff"
     borderopacity="1"
     inkscape:pageopacity="0.0"
     inkscape:pageshadow="2"
     inkscape:zoom="0.49497475"
     inkscape:cx="847.09768"
     inkscape:cy="628.75069"
     inkscape:document-units="px"
     inkscape:current-layer="layer1"
     showgrid="false"
     units="px"
     borderlayer="true"
     inkscape:showpageshadow="false"
     inkscape:pagecheckerboard="true"
     inkscape:window-width="1920"
     inkscape:window-height="951"
     inkscape:window-x="0"
     inkscape:window-y="55"
     inkscape:window-maximized="1"
     showguides="false" />
  <metadata
     id="metadata5">
    <rdf:RDF>
      <cc:Work
         rdf:about="">
        <dc:format>image/svg+xml</dc:format>
        <dc:type
           rdf:resource="http://purl.org/dc/dcmitype/StillImage" />
        <dc:title></dc:title>
        <cc:license
           rdf:resource="http://creativecommons.org/licenses/by-sa/4.0/" />
      </cc:Work>
      <cc:License
         rdf:about="http://creativecommons.org/licenses/by-sa/4.0/">
        <cc:permits
           rdf:resource="http://creativecommons.org/ns#Reproduction" />
        <cc:permits
           rdf:resource="http://creativecommons.org/ns#Distribution" />
        <cc:requires
           rdf:resource="http://creativecommons.org/ns#Notice" />
        <cc:requires
           rdf:resource="http://creativecommons.org/ns#Attribution" />
        <cc:permits
           rdf:resource="http://creativecommons.org/ns#DerivativeWorks" />
        <cc:requires
           rdf:resource="http://creativecommons.org/ns#ShareAlike" />
      </cc:License>
    </rdf:RDF>
  </metadata>
  <g
     inkscape:label="Layer 1"
     inkscape:groupmode="layer"
     id="layer1"
     transform="translate(0,-11.249975)">
    <rect
       style="color:#000000;clip-rule:nonzero;display:inline;overflow:visible;visibility:visible;opacity:1;isolation:auto;mix-blend-mode:normal;color-interpolation:sRGB;color-interpolation-filters:linearRGB;solid-color:#000000;solid-opacity:1;vector-effect:none;fill:#232323;fill-opacity:1;fill-rule:nonzero;stroke:none;stroke-width:0.3055087;stroke-linecap:round;stroke-linejoin:round;stroke-miterlimit:4;stroke-dasharray:none;stroke-dashoffset:0;stroke-opacity:1;color-rendering:auto;image-rendering:auto;shape-rendering:auto;text-rendering:auto;enable-background:accumulate"
       id="rect2926"
       width="512.95203"
       height="292.72192"
       x="-2.0354033"
       y="8.4516382" />
    <text
       xml:space="preserve"
       style="font-style:normal;font-variant:normal;font-weight:normal;font-stretch:normal;font-size:25.40000153px;line-height:6.61458349px;font-family:'Century Schoolbook L';-inkscape-font-specification:'Century Schoolbook L';letter-spacing:0px;word-spacing:0px;fill:#000000;fill-opacity:1;stroke:none;stroke-width:0.26458335px;stroke-linecap:butt;stroke-linejoin:miter;stroke-opacity:1;"
       x="238.13715"
       y="144.99043"
       id="text9454"><tspan
         sodipodi:role="line"
         id="tspan9452"
         x="238.13715"
         y="154.26672"
         style="font-style:normal;font-variant:normal;font-weight:normal;font-stretch:normal;font-family:'Century Schoolbook L';-inkscape-font-specification:'Century Schoolbook L';stroke-width:0.26458335px;" /></text>
    <flowRoot
       transform="matrix(0.42305208,0,0,0.42305208,-30.171396,-23.993117)"
       xml:space="preserve"
       id="flowRoot17214"
       style="font-style:normal;font-weight:normal;font-size:20px;line-height:25px;font-family:Sans;letter-spacing:0px;word-spacing:0px;fill:#000000;fill-opacity:1;stroke:none;stroke-width:1px;stroke-linecap:butt;stroke-linejoin:miter;stroke-opacity:1"><flowRegion
         id="flowRegion17216"><rect
           id="rect17218"
           width="32.251968"
           height="32.251968"
           x="378.96063"
           y="282.20471"
           style="fill:none;stroke:#000000;stroke-linecap:round;stroke-linejoin:round;stroke-miterlimit:10" /></flowRegion><flowPara
         id="flowPara17220" /></flowRoot>    <text
       xml:space="preserve"
       style="font-style:normal;font-variant:normal;font-weight:normal;font-stretch:normal;font-size:11.99654388px;line-height:0%;font-family:'League Gothic';-inkscape-font-specification:'League Gothic';text-align:start;letter-spacing:0px;word-spacing:0px;text-anchor:start;fill:#ffbf2d;fill-opacity:1;stroke:none;stroke-width:0.29991367;stroke-linecap:butt;stroke-linejoin:miter;stroke-miterlimit:4;stroke-dasharray:none;stroke-opacity:1"
       x="81.530411"
       y="106.104"
       id="text4140-4-6"><tspan
         sodipodi:role="line"
         x="81.530411"
         y="106.104"
         style="font-style:normal;font-variant:normal;font-weight:normal;font-stretch:normal;font-size:34.98992157px;line-height:100%;font-family:'League Gothic';-inkscape-font-specification:'League Gothic';text-align:start;text-anchor:start;fill:#ffbf2d;fill-opacity:1;stroke:none;stroke-width:0.29991367;stroke-miterlimit:4;stroke-dasharray:none;stroke-opacity:1"
         id="tspan14820"><tspan
   style="line-height:100%;text-align:start;text-anchor:start;fill:#ffffff"
   id="tspan14783">guix package</tspan> --manifest</tspan></text>
    <g
       style="font-style:normal;font-variant:normal;font-weight:normal;font-stretch:normal;font-size:12.50831032px;line-height:15.63538837px;font-family:'DejaVu Sans Mono';-inkscape-font-specification:'DejaVu Sans Mono';letter-spacing:0px;word-spacing:0px;fill:#000000;fill-opacity:1;stroke:none;stroke-width:0.6254155px;stroke-linecap:butt;stroke-linejoin:miter;stroke-opacity:1"
       transform="matrix(2.3514447,0,0,2.3514447,-207.37304,-1686.7694)"
       id="g10050">
      <g
         id="g10824">
        <g
           transform="translate(-249.89671,206.5843)"
           id="g9983">
          <rect
             style="opacity:1;fill:none;fill-opacity:1;stroke:#ffbf2d;stroke-width:2.00132966;stroke-linecap:butt;stroke-linejoin:round;stroke-miterlimit:4;stroke-dasharray:none;stroke-opacity:1"
             id="rect8121-3"
             width="28.365301"
             height="18.910202"
             x="472.82416"
             y="582.01929"
             ry="2.3126142"
             rx="3.0025494" />
          <path
             style="opacity:1;fill:#ffbf2d;fill-opacity:1;fill-rule:nonzero;stroke:#ffbf2d;stroke-width:2.00132966;stroke-linecap:butt;stroke-linejoin:round;stroke-miterlimit:4;stroke-dasharray:none;stroke-opacity:1"
             d="m 475.75129,601.40118 h 22.3602 c 1.66342,0 2.55853,1.11083 3.00255,2.31261 l 1.33422,3.61122 c 0.44402,1.20179 -1.33913,2.31261 -3.00255,2.31261 h -25.02864 c -1.66341,0 -3.44657,-1.11082 -3.00255,-2.31261 l 1.33422,-3.61122 c 0.44402,-1.20178 1.33914,-2.31261 3.00255,-2.31261 z"
             id="rect8121-4-8"
             inkscape:connector-curvature="0"
             sodipodi:nodetypes="sssssssss" />
          <path
             style="opacity:1;fill:none;fill-opacity:1;fill-rule:nonzero;stroke:#0e0e0e;stroke-width:0.34747496;stroke-linecap:butt;stroke-linejoin:round;stroke-miterlimit:4;stroke-dasharray:none;stroke-opacity:1"
             d="m 474.99885,601.4932 h 1.70765 c 0.35477,0 0.64037,0.28561 0.64037,0.64037 v 1.03679 c 0,0.35477 -0.2856,0.64037 -0.64037,0.64037 h -1.70833 c -0.35476,0 -0.6406,-0.2856 -0.64037,-0.64037 l 6.8e-4,-1.03679 c 2.3e-4,-0.35476 0.28561,-0.64037 0.64037,-0.64037 z"
             id="rect9741-81"
             inkscape:connector-curvature="0"
             sodipodi:nodetypes="sssssssss" />
          <path
             style="opacity:1;fill:none;fill-opacity:1;fill-rule:nonzero;stroke:#0e0e0e;stroke-width:0.34747496;stroke-linecap:butt;stroke-linejoin:round;stroke-miterlimit:4;stroke-dasharray:none;stroke-opacity:1"
             d="m 478.68731,601.4932 h 1.70765 c 0.35477,0 0.64037,0.28561 0.64037,0.64037 v 1.03679 c 0,0.35477 -0.2856,0.64037 -0.64037,0.64037 h -1.70833 c -0.35476,0 -0.6406,-0.2856 -0.64037,-0.64037 l 6.7e-4,-1.03679 c 2.3e-4,-0.35476 0.28561,-0.64037 0.64037,-0.64037 z"
             id="rect9741-5-0"
             inkscape:connector-curvature="0"
             sodipodi:nodetypes="sssssssss" />
          <path
             style="opacity:1;fill:none;fill-opacity:1;fill-rule:nonzero;stroke:#0e0e0e;stroke-width:0.34747496;stroke-linecap:butt;stroke-linejoin:round;stroke-miterlimit:4;stroke-dasharray:none;stroke-opacity:1"
             d="m 482.37577,601.4932 h 1.70765 c 0.35477,0 0.64037,0.28561 0.64037,0.64037 v 1.03679 c 0,0.35477 -0.2856,0.64037 -0.64037,0.64037 h -1.70833 c -0.35476,0 -0.6406,-0.2856 -0.64037,-0.64037 l 6.7e-4,-1.03679 c 2.3e-4,-0.35476 0.28561,-0.64037 0.64037,-0.64037 z"
             id="rect9741-8-45"
             inkscape:connector-curvature="0"
             sodipodi:nodetypes="sssssssss" />
          <path
             style="opacity:1;fill:none;fill-opacity:1;fill-rule:nonzero;stroke:#0e0e0e;stroke-width:0.34747496;stroke-linecap:butt;stroke-linejoin:round;stroke-miterlimit:4;stroke-dasharray:none;stroke-opacity:1"
             d="m 486.06424,601.4932 h 1.70765 c 0.35477,0 0.64037,0.28561 0.64037,0.64037 v 1.03679 c 0,0.35477 -0.2856,0.64037 -0.64037,0.64037 h -1.70833 c -0.35476,0 -0.6406,-0.2856 -0.64037,-0.64037 l 6.7e-4,-1.03679 c 2.3e-4,-0.35476 0.28561,-0.64037 0.64037,-0.64037 z"
             id="rect9741-5-4-2"
             inkscape:connector-curvature="0"
             sodipodi:nodetypes="sssssssss" />
          <path
             style="opacity:1;fill:none;fill-opacity:1;fill-rule:nonzero;stroke:#0e0e0e;stroke-width:0.34747496;stroke-linecap:butt;stroke-linejoin:round;stroke-miterlimit:4;stroke-dasharray:none;stroke-opacity:1"
             d="m 489.7527,601.4932 h 1.70765 c 0.35477,0 0.64037,0.28561 0.64037,0.64037 v 1.03679 c 0,0.35477 -0.2856,0.64037 -0.64037,0.64037 h -1.70833 c -0.35476,0 -0.6406,-0.2856 -0.64037,-0.64037 l 6.7e-4,-1.03679 c 2.3e-4,-0.35476 0.28561,-0.64037 0.64037,-0.64037 z"
             id="rect9741-89-9"
             inkscape:connector-curvature="0"
             sodipodi:nodetypes="sssssssss" />
          <path
             style="opacity:1;fill:none;fill-opacity:1;fill-rule:nonzero;stroke:#0e0e0e;stroke-width:0.34747496;stroke-linecap:butt;stroke-linejoin:round;stroke-miterlimit:4;stroke-dasharray:none;stroke-opacity:1"
             d="m 493.44116,601.4932 h 1.70765 c 0.35477,0 0.64037,0.28561 0.64037,0.64037 v 1.03679 c 0,0.35477 -0.2856,0.64037 -0.64037,0.64037 h -1.70833 c -0.35476,0 -0.6406,-0.2856 -0.64037,-0.64037 l 6.7e-4,-1.03679 c 2.3e-4,-0.35476 0.28561,-0.64037 0.64037,-0.64037 z"
             id="rect9741-5-8-7"
             inkscape:connector-curvature="0"
             sodipodi:nodetypes="sssssssss" />
          <path
             style="opacity:1;fill:none;fill-opacity:1;fill-rule:nonzero;stroke:#0e0e0e;stroke-width:0.34747496;stroke-linecap:butt;stroke-linejoin:round;stroke-miterlimit:4;stroke-dasharray:none;stroke-opacity:1"
             d="m 497.12962,601.4932 h 1.70765 c 0.35477,0 0.64037,0.28561 0.64037,0.64037 v 1.03679 c 0,0.35477 -0.2856,0.64037 -0.64037,0.64037 h -1.70833 c -0.35476,0 -0.6406,-0.2856 -0.64037,-0.64037 l 6.7e-4,-1.03679 c 2.3e-4,-0.35476 0.28561,-0.64037 0.64037,-0.64037 z"
             id="rect9741-8-5-9"
             inkscape:connector-curvature="0"
             sodipodi:nodetypes="sssssssss" />
          <path
             style="opacity:1;fill:none;fill-opacity:1;fill-rule:nonzero;stroke:#0e0e0e;stroke-width:0.34747496;stroke-linecap:butt;stroke-linejoin:round;stroke-miterlimit:4;stroke-dasharray:none;stroke-opacity:1"
             d="m 473.24441,604.50228 h 1.70765 c 0.35477,0 0.64037,0.28561 0.64037,0.64037 v 1.03679 c 0,0.35477 -0.2856,0.64037 -0.64037,0.64037 h -1.70833 c -0.35476,0 -0.6406,-0.2856 -0.64037,-0.64037 l 6.8e-4,-1.03679 c 2.3e-4,-0.35476 0.28561,-0.64037 0.64037,-0.64037 z"
             id="rect9741-2-7"
             inkscape:connector-curvature="0"
             sodipodi:nodetypes="sssssssss" />
          <path
             style="opacity:1;fill:none;fill-opacity:1;fill-rule:nonzero;stroke:#0e0e0e;stroke-width:0.34747496;stroke-linecap:butt;stroke-linejoin:round;stroke-miterlimit:4;stroke-dasharray:none;stroke-opacity:1"
             d="m 476.93287,604.50228 h 1.70765 c 0.35477,0 0.64037,0.28561 0.64037,0.64037 v 1.03679 c 0,0.35477 -0.2856,0.64037 -0.64037,0.64037 h -1.70833 c -0.35476,0 -0.6406,-0.2856 -0.64037,-0.64037 l 6.8e-4,-1.03679 c 2.3e-4,-0.35476 0.28561,-0.64037 0.64037,-0.64037 z"
             id="rect9741-5-47-2"
             inkscape:connector-curvature="0"
             sodipodi:nodetypes="sssssssss" />
          <path
             style="opacity:1;fill:none;fill-opacity:1;fill-rule:nonzero;stroke:#0e0e0e;stroke-width:0.34747496;stroke-linecap:butt;stroke-linejoin:round;stroke-miterlimit:4;stroke-dasharray:none;stroke-opacity:1"
             d="m 480.62133,604.50228 h 1.70765 c 0.35477,0 0.64037,0.28561 0.64037,0.64037 v 1.03679 c 0,0.35477 -0.2856,0.64037 -0.64037,0.64037 h -1.70833 c -0.35476,0 -0.6406,-0.2856 -0.64037,-0.64037 l 6.7e-4,-1.03679 c 2.3e-4,-0.35476 0.28561,-0.64037 0.64037,-0.64037 z"
             id="rect9741-8-4-9"
             inkscape:connector-curvature="0"
             sodipodi:nodetypes="sssssssss" />
          <path
             style="opacity:1;fill:none;fill-opacity:1;fill-rule:nonzero;stroke:#0e0e0e;stroke-width:0.34747496;stroke-linecap:butt;stroke-linejoin:round;stroke-miterlimit:4;stroke-dasharray:none;stroke-opacity:1"
             d="m 484.3098,604.50228 h 1.70765 c 0.35477,0 0.64037,0.28561 0.64037,0.64037 v 1.03679 c 0,0.35477 -0.2856,0.64037 -0.64037,0.64037 h -1.70833 c -0.35476,0 -0.6406,-0.2856 -0.64037,-0.64037 l 6.7e-4,-1.03679 c 2.3e-4,-0.35476 0.28561,-0.64037 0.64037,-0.64037 z"
             id="rect9741-5-4-0-8"
             inkscape:connector-curvature="0"
             sodipodi:nodetypes="sssssssss" />
          <path
             style="opacity:1;fill:none;fill-opacity:1;fill-rule:nonzero;stroke:#0e0e0e;stroke-width:0.34747496;stroke-linecap:butt;stroke-linejoin:round;stroke-miterlimit:4;stroke-dasharray:none;stroke-opacity:1"
             d="m 487.99826,604.50228 h 1.70765 c 0.35477,0 0.64037,0.28561 0.64037,0.64037 v 1.03679 c 0,0.35477 -0.2856,0.64037 -0.64037,0.64037 h -1.70833 c -0.35476,0 -0.6406,-0.2856 -0.64037,-0.64037 l 6.7e-4,-1.03679 c 2.3e-4,-0.35476 0.28561,-0.64037 0.64037,-0.64037 z"
             id="rect9741-89-7-2"
             inkscape:connector-curvature="0"
             sodipodi:nodetypes="sssssssss" />
          <path
             style="opacity:1;fill:none;fill-opacity:1;fill-rule:nonzero;stroke:#0e0e0e;stroke-width:0.34747496;stroke-linecap:butt;stroke-linejoin:round;stroke-miterlimit:4;stroke-dasharray:none;stroke-opacity:1"
             d="m 491.68672,604.50228 h 1.70765 c 0.35477,0 0.64037,0.28561 0.64037,0.64037 v 1.03679 c 0,0.35477 -0.2856,0.64037 -0.64037,0.64037 h -1.70833 c -0.35476,0 -0.6406,-0.2856 -0.64037,-0.64037 l 6.7e-4,-1.03679 c 2.3e-4,-0.35476 0.28561,-0.64037 0.64037,-0.64037 z"
             id="rect9741-5-8-8-6"
             inkscape:connector-curvature="0"
             sodipodi:nodetypes="sssssssss" />
          <path
             style="opacity:1;fill:none;fill-opacity:1;fill-rule:nonzero;stroke:#0e0e0e;stroke-width:0.34747496;stroke-linecap:butt;stroke-linejoin:round;stroke-miterlimit:4;stroke-dasharray:none;stroke-opacity:1"
             d="m 495.37518,604.50228 h 1.70765 c 0.35477,0 0.64037,0.28561 0.64037,0.64037 v 1.03679 c 0,0.35477 -0.2856,0.64037 -0.64037,0.64037 h -1.70833 c -0.35476,0 -0.6406,-0.2856 -0.64037,-0.64037 l 6.7e-4,-1.03679 c 2.3e-4,-0.35476 0.28561,-0.64037 0.64037,-0.64037 z"
             id="rect9741-8-5-6-1"
             inkscape:connector-curvature="0"
             sodipodi:nodetypes="sssssssss" />
          <path
             style="opacity:1;fill:none;fill-opacity:1;fill-rule:nonzero;stroke:#0e0e0e;stroke-width:0.34747496;stroke-linecap:butt;stroke-linejoin:round;stroke-miterlimit:4;stroke-dasharray:none;stroke-opacity:1"
             d="m 482.54168,607.5425 h 8.37875 c 0.35477,0 0.64037,0.28561 0.64037,0.64037 v 1.03679 c 0,0.35477 -0.2856,0.64037 -0.64037,0.64037 H 482.541 c -0.35476,0 -0.6406,-0.2856 -0.64037,-0.64037 l 6.7e-4,-1.03679 c 2.3e-4,-0.35476 0.28561,-0.64037 0.64037,-0.64037 z"
             id="rect9741-89-7-3-7"
             inkscape:connector-curvature="0"
             sodipodi:nodetypes="cssssssssc" />
          <path
             style="opacity:1;fill:none;fill-opacity:1;fill-rule:nonzero;stroke:#0e0e0e;stroke-width:0.34747496;stroke-linecap:butt;stroke-linejoin:round;stroke-miterlimit:4;stroke-dasharray:none;stroke-opacity:1"
             d="m 478.83296,607.45503 h 1.70765 c 0.35477,0 0.64037,0.28561 0.64037,0.64037 v 1.03679 c 0,0.35477 -0.2856,0.64037 -0.64037,0.64037 h -1.70833 c -0.35476,0 -0.6406,-0.2856 -0.64037,-0.64037 l 6.7e-4,-1.03679 c 2.3e-4,-0.35476 0.28561,-0.64037 0.64037,-0.64037 z"
             id="rect9741-5-47-6-2"
             inkscape:connector-curvature="0"
             sodipodi:nodetypes="sssssssss" />
          <path
             style="opacity:1;fill:none;fill-opacity:1;fill-rule:nonzero;stroke:#0e0e0e;stroke-width:0.34747496;stroke-linecap:butt;stroke-linejoin:round;stroke-miterlimit:4;stroke-dasharray:none;stroke-opacity:1"
             d="m 492.93475,607.58441 h 1.70765 c 0.35477,0 0.64037,0.28561 0.64037,0.64037 v 1.03679 c 0,0.35477 -0.2856,0.64037 -0.64037,0.64037 h -1.70833 c -0.35476,0 -0.6406,-0.2856 -0.64037,-0.64037 l 6.7e-4,-1.03679 c 2.3e-4,-0.35476 0.28561,-0.64037 0.64037,-0.64037 z"
             id="rect9741-5-47-6-8-8"
             inkscape:connector-curvature="0"
             sodipodi:nodetypes="sssssssss" />
        </g>
        <g
           id="g4450-1"
           transform="matrix(0.15414834,0,0,0.15414834,136.98652,760.70514)"
           style="fill:#ffffff;fill-opacity:1;stroke:none;stroke-opacity:1">
          <rect
             y="225.08789"
             x="334.68536"
             height="47.477169"
             width="110.10662"
             id="rect4383-0"
             style="opacity:1;fill:#ffffff;fill-opacity:1;stroke:none;stroke-width:10;stroke-linejoin:miter;stroke-miterlimit:4;stroke-dasharray:none;stroke-opacity:1" />
          <path
             inkscape:transform-center-x="-12.609217"
             d="m 413.51262,292.99084 0,-43.67961 0,-43.6796 37.82765,21.8398 37.82765,21.8398 -37.82766,21.83981 z"
             inkscape:randomized="0"
             inkscape:rounded="0"
             inkscape:flatsided="false"
             sodipodi:arg2="3.1415927"
             sodipodi:arg1="2.0943951"
             sodipodi:r2="25.218433"
             sodipodi:r1="50.436867"
             sodipodi:cy="249.31123"
             sodipodi:cx="438.73105"
             sodipodi:sides="3"
             id="path4385-9"
             style="opacity:1;fill:#ffffff;fill-opacity:1;stroke:none;stroke-width:10;stroke-linejoin:miter;stroke-miterlimit:4;stroke-dasharray:none;stroke-opacity:1"
             sodipodi:type="star" />
        </g>
        <g
           id="g10798"
           transform="translate(-274.01602,181.16762)">
          <g
             id="g10771">
            <rect
               rx="3.0025492"
               ry="2.3126142"
               y="599.55341"
               x="425.77008"
               height="18.910202"
               width="28.365301"
               id="rect8121"
               style="opacity:1;fill:none;fill-opacity:1;stroke:#ffbf2d;stroke-width:2.00132966;stroke-linecap:butt;stroke-linejoin:round;stroke-miterlimit:4;stroke-dasharray:none;stroke-opacity:1" />
            <path
               sodipodi:nodetypes="sssssssss"
               inkscape:connector-curvature="0"
               id="rect8121-4"
               d="m 428.69716,626.3397 h 22.3602 c 1.66342,0 2.55853,1.11083 3.00255,2.31261 l 1.33422,3.61122 c 0.44402,1.20179 -1.33913,2.31261 -3.00255,2.31261 h -25.02864 c -1.66341,0 -3.44657,-1.11082 -3.00255,-2.31261 l 1.33422,-3.61122 c 0.44402,-1.20178 1.33914,-2.31261 3.00255,-2.31261 z"
               style="opacity:1;fill:#ffbf2d;fill-opacity:1;fill-rule:nonzero;stroke:#ffbf2d;stroke-width:2.00132966;stroke-linecap:butt;stroke-linejoin:round;stroke-miterlimit:4;stroke-dasharray:none;stroke-opacity:1" />
            <path
               sodipodi:nodetypes="sssssssss"
               inkscape:connector-curvature="0"
               id="rect9741"
               d="m 427.94472,626.43172 h 1.70765 c 0.35477,0 0.64037,0.28561 0.64037,0.64037 v 1.03679 c 0,0.35477 -0.2856,0.64037 -0.64037,0.64037 h -1.70833 c -0.35476,0 -0.6406,-0.2856 -0.64037,-0.64037 l 6.8e-4,-1.03679 c 2.3e-4,-0.35476 0.28561,-0.64037 0.64037,-0.64037 z"
               style="opacity:1;fill:none;fill-opacity:1;fill-rule:nonzero;stroke:#151515;stroke-width:0.34747496;stroke-linecap:butt;stroke-linejoin:round;stroke-miterlimit:4;stroke-dasharray:none;stroke-opacity:1" />
            <path
               sodipodi:nodetypes="sssssssss"
               inkscape:connector-curvature="0"
               id="rect9741-5"
               d="m 431.63318,626.43172 h 1.70765 c 0.35477,0 0.64037,0.28561 0.64037,0.64037 v 1.03679 c 0,0.35477 -0.2856,0.64037 -0.64037,0.64037 h -1.70833 c -0.35476,0 -0.6406,-0.2856 -0.64037,-0.64037 l 6.8e-4,-1.03679 c 2.3e-4,-0.35476 0.28561,-0.64037 0.64037,-0.64037 z"
               style="opacity:1;fill:none;fill-opacity:1;fill-rule:nonzero;stroke:#151515;stroke-width:0.34747496;stroke-linecap:butt;stroke-linejoin:round;stroke-miterlimit:4;stroke-dasharray:none;stroke-opacity:1" />
            <path
               sodipodi:nodetypes="sssssssss"
               inkscape:connector-curvature="0"
               id="rect9741-8"
               d="m 435.32164,626.43172 h 1.70765 c 0.35477,0 0.64037,0.28561 0.64037,0.64037 v 1.03679 c 0,0.35477 -0.2856,0.64037 -0.64037,0.64037 h -1.70833 c -0.35476,0 -0.6406,-0.2856 -0.64037,-0.64037 l 6.8e-4,-1.03679 c 2.3e-4,-0.35476 0.28561,-0.64037 0.64037,-0.64037 z"
               style="opacity:1;fill:none;fill-opacity:1;fill-rule:nonzero;stroke:#151515;stroke-width:0.34747496;stroke-linecap:butt;stroke-linejoin:round;stroke-miterlimit:4;stroke-dasharray:none;stroke-opacity:1" />
            <path
               sodipodi:nodetypes="sssssssss"
               inkscape:connector-curvature="0"
               id="rect9741-5-4"
               d="m 439.01011,626.43172 h 1.70765 c 0.35477,0 0.64037,0.28561 0.64037,0.64037 v 1.03679 c 0,0.35477 -0.2856,0.64037 -0.64037,0.64037 h -1.70833 c -0.35476,0 -0.6406,-0.2856 -0.64037,-0.64037 l 6.8e-4,-1.03679 c 2.3e-4,-0.35476 0.28561,-0.64037 0.64037,-0.64037 z"
               style="opacity:1;fill:none;fill-opacity:1;fill-rule:nonzero;stroke:#151515;stroke-width:0.34747496;stroke-linecap:butt;stroke-linejoin:round;stroke-miterlimit:4;stroke-dasharray:none;stroke-opacity:1" />
            <path
               sodipodi:nodetypes="sssssssss"
               inkscape:connector-curvature="0"
               id="rect9741-89"
               d="m 442.69857,626.43172 h 1.70765 c 0.35477,0 0.64037,0.28561 0.64037,0.64037 v 1.03679 c 0,0.35477 -0.2856,0.64037 -0.64037,0.64037 h -1.70833 c -0.35476,0 -0.6406,-0.2856 -0.64037,-0.64037 l 6.8e-4,-1.03679 c 2.3e-4,-0.35476 0.28561,-0.64037 0.64037,-0.64037 z"
               style="opacity:1;fill:none;fill-opacity:1;fill-rule:nonzero;stroke:#151515;stroke-width:0.34747496;stroke-linecap:butt;stroke-linejoin:round;stroke-miterlimit:4;stroke-dasharray:none;stroke-opacity:1" />
            <path
               sodipodi:nodetypes="sssssssss"
               inkscape:connector-curvature="0"
               id="rect9741-5-8"
               d="m 446.38703,626.43172 h 1.70765 c 0.35477,0 0.64037,0.28561 0.64037,0.64037 v 1.03679 c 0,0.35477 -0.2856,0.64037 -0.64037,0.64037 h -1.70833 c -0.35476,0 -0.6406,-0.2856 -0.64037,-0.64037 l 6.8e-4,-1.03679 c 2.3e-4,-0.35476 0.28561,-0.64037 0.64037,-0.64037 z"
               style="opacity:1;fill:none;fill-opacity:1;fill-rule:nonzero;stroke:#151515;stroke-width:0.34747496;stroke-linecap:butt;stroke-linejoin:round;stroke-miterlimit:4;stroke-dasharray:none;stroke-opacity:1" />
            <path
               sodipodi:nodetypes="sssssssss"
               inkscape:connector-curvature="0"
               id="rect9741-8-5"
               d="m 450.07549,626.43172 h 1.70765 c 0.35477,0 0.64037,0.28561 0.64037,0.64037 v 1.03679 c 0,0.35477 -0.2856,0.64037 -0.64037,0.64037 h -1.70833 c -0.35476,0 -0.6406,-0.2856 -0.64037,-0.64037 l 6.7e-4,-1.03679 c 2.3e-4,-0.35476 0.28561,-0.64037 0.64037,-0.64037 z"
               style="opacity:1;fill:none;fill-opacity:1;fill-rule:nonzero;stroke:#151515;stroke-width:0.34747496;stroke-linecap:butt;stroke-linejoin:round;stroke-miterlimit:4;stroke-dasharray:none;stroke-opacity:1" />
            <path
               sodipodi:nodetypes="sssssssss"
               inkscape:connector-curvature="0"
               id="rect9741-2"
               d="m 426.19028,629.4408 h 1.70765 c 0.35477,0 0.64037,0.28561 0.64037,0.64037 v 1.03679 c 0,0.35477 -0.2856,0.64037 -0.64037,0.64037 h -1.70833 c -0.35476,0 -0.6406,-0.2856 -0.64037,-0.64037 l 6.8e-4,-1.03679 c 2.3e-4,-0.35476 0.28561,-0.64037 0.64037,-0.64037 z"
               style="opacity:1;fill:none;fill-opacity:1;fill-rule:nonzero;stroke:#151515;stroke-width:0.34747496;stroke-linecap:butt;stroke-linejoin:round;stroke-miterlimit:4;stroke-dasharray:none;stroke-opacity:1" />
            <path
               sodipodi:nodetypes="sssssssss"
               inkscape:connector-curvature="0"
               id="rect9741-5-47"
               d="m 429.87874,629.4408 h 1.70765 c 0.35477,0 0.64037,0.28561 0.64037,0.64037 v 1.03679 c 0,0.35477 -0.2856,0.64037 -0.64037,0.64037 h -1.70833 c -0.35476,0 -0.6406,-0.2856 -0.64037,-0.64037 l 6.8e-4,-1.03679 c 2.3e-4,-0.35476 0.28561,-0.64037 0.64037,-0.64037 z"
               style="opacity:1;fill:none;fill-opacity:1;fill-rule:nonzero;stroke:#151515;stroke-width:0.34747496;stroke-linecap:butt;stroke-linejoin:round;stroke-miterlimit:4;stroke-dasharray:none;stroke-opacity:1" />
            <path
               sodipodi:nodetypes="sssssssss"
               inkscape:connector-curvature="0"
               id="rect9741-8-4"
               d="m 433.5672,629.4408 h 1.70765 c 0.35477,0 0.64037,0.28561 0.64037,0.64037 v 1.03679 c 0,0.35477 -0.2856,0.64037 -0.64037,0.64037 h -1.70833 c -0.35476,0 -0.6406,-0.2856 -0.64037,-0.64037 l 6.7e-4,-1.03679 c 2.3e-4,-0.35476 0.28561,-0.64037 0.64037,-0.64037 z"
               style="opacity:1;fill:none;fill-opacity:1;fill-rule:nonzero;stroke:#151515;stroke-width:0.34747496;stroke-linecap:butt;stroke-linejoin:round;stroke-miterlimit:4;stroke-dasharray:none;stroke-opacity:1" />
            <path
               sodipodi:nodetypes="sssssssss"
               inkscape:connector-curvature="0"
               id="rect9741-5-4-0"
               d="m 437.25567,629.4408 h 1.70765 c 0.35477,0 0.64037,0.28561 0.64037,0.64037 v 1.03679 c 0,0.35477 -0.2856,0.64037 -0.64037,0.64037 h -1.70833 c -0.35476,0 -0.6406,-0.2856 -0.64037,-0.64037 l 6.7e-4,-1.03679 c 2.3e-4,-0.35476 0.28561,-0.64037 0.64037,-0.64037 z"
               style="opacity:1;fill:none;fill-opacity:1;fill-rule:nonzero;stroke:#151515;stroke-width:0.34747496;stroke-linecap:butt;stroke-linejoin:round;stroke-miterlimit:4;stroke-dasharray:none;stroke-opacity:1" />
            <path
               sodipodi:nodetypes="sssssssss"
               inkscape:connector-curvature="0"
               id="rect9741-89-7"
               d="m 440.94413,629.4408 h 1.70765 c 0.35477,0 0.64037,0.28561 0.64037,0.64037 v 1.03679 c 0,0.35477 -0.2856,0.64037 -0.64037,0.64037 h -1.70833 c -0.35476,0 -0.6406,-0.2856 -0.64037,-0.64037 l 6.7e-4,-1.03679 c 2.3e-4,-0.35476 0.28561,-0.64037 0.64037,-0.64037 z"
               style="opacity:1;fill:none;fill-opacity:1;fill-rule:nonzero;stroke:#151515;stroke-width:0.34747496;stroke-linecap:butt;stroke-linejoin:round;stroke-miterlimit:4;stroke-dasharray:none;stroke-opacity:1" />
            <path
               sodipodi:nodetypes="sssssssss"
               inkscape:connector-curvature="0"
               id="rect9741-5-8-8"
               d="m 444.63259,629.4408 h 1.70765 c 0.35477,0 0.64037,0.28561 0.64037,0.64037 v 1.03679 c 0,0.35477 -0.2856,0.64037 -0.64037,0.64037 h -1.70833 c -0.35476,0 -0.6406,-0.2856 -0.64037,-0.64037 l 6.7e-4,-1.03679 c 2.3e-4,-0.35476 0.28561,-0.64037 0.64037,-0.64037 z"
               style="opacity:1;fill:none;fill-opacity:1;fill-rule:nonzero;stroke:#151515;stroke-width:0.34747496;stroke-linecap:butt;stroke-linejoin:round;stroke-miterlimit:4;stroke-dasharray:none;stroke-opacity:1" />
            <path
               sodipodi:nodetypes="sssssssss"
               inkscape:connector-curvature="0"
               id="rect9741-8-5-6"
               d="m 448.32105,629.4408 h 1.70765 c 0.35477,0 0.64037,0.28561 0.64037,0.64037 v 1.03679 c 0,0.35477 -0.2856,0.64037 -0.64037,0.64037 h -1.70833 c -0.35476,0 -0.6406,-0.2856 -0.64037,-0.64037 l 6.7e-4,-1.03679 c 2.3e-4,-0.35476 0.28561,-0.64037 0.64037,-0.64037 z"
               style="opacity:1;fill:none;fill-opacity:1;fill-rule:nonzero;stroke:#151515;stroke-width:0.34747496;stroke-linecap:butt;stroke-linejoin:round;stroke-miterlimit:4;stroke-dasharray:none;stroke-opacity:1" />
            <path
               sodipodi:nodetypes="cssssssssc"
               inkscape:connector-curvature="0"
               id="rect9741-89-7-3"
               d="m 435.48755,632.48102 h 8.37875 c 0.35477,0 0.64037,0.28561 0.64037,0.64037 v 1.03679 c 0,0.35477 -0.2856,0.64037 -0.64037,0.64037 h -8.37943 c -0.35476,0 -0.6406,-0.2856 -0.64037,-0.64037 l 6.7e-4,-1.03679 c 2.3e-4,-0.35476 0.28561,-0.64037 0.64037,-0.64037 z"
               style="opacity:1;fill:none;fill-opacity:1;fill-rule:nonzero;stroke:#151515;stroke-width:0.34747496;stroke-linecap:butt;stroke-linejoin:round;stroke-miterlimit:4;stroke-dasharray:none;stroke-opacity:1" />
            <path
               sodipodi:nodetypes="sssssssss"
               inkscape:connector-curvature="0"
               id="rect9741-5-47-6"
               d="m 431.77883,632.39355 h 1.70765 c 0.35477,0 0.64037,0.28561 0.64037,0.64037 v 1.03679 c 0,0.35477 -0.2856,0.64037 -0.64037,0.64037 h -1.70833 c -0.35476,0 -0.6406,-0.2856 -0.64037,-0.64037 l 6.8e-4,-1.03679 c 2.3e-4,-0.35476 0.28561,-0.64037 0.64037,-0.64037 z"
               style="opacity:1;fill:none;fill-opacity:1;fill-rule:nonzero;stroke:#151515;stroke-width:0.34747496;stroke-linecap:butt;stroke-linejoin:round;stroke-miterlimit:4;stroke-dasharray:none;stroke-opacity:1" />
            <path
               sodipodi:nodetypes="sssssssss"
               inkscape:connector-curvature="0"
               id="rect9741-5-47-6-8"
               d="m 445.88062,632.52293 h 1.70765 c 0.35477,0 0.64037,0.28561 0.64037,0.64037 v 1.03679 c 0,0.35477 -0.2856,0.64037 -0.64037,0.64037 h -1.70833 c -0.35476,0 -0.6406,-0.2856 -0.64037,-0.64037 l 6.8e-4,-1.03679 c 2.3e-4,-0.35476 0.28561,-0.64037 0.64037,-0.64037 z"
               style="opacity:1;fill:none;fill-opacity:1;fill-rule:nonzero;stroke:#151515;stroke-width:0.34747496;stroke-linecap:butt;stroke-linejoin:round;stroke-miterlimit:4;stroke-dasharray:none;stroke-opacity:1" />
            <path
               sodipodi:nodetypes="casacccc"
               inkscape:connector-curvature="0"
               id="rect10740"
               d="m 432.32657,622.1862 c 0,0 2.59194,-0.28326 3.77364,-0.78809 1.40308,-0.59941 2.40179,-2.58038 3.77364,-2.59054 1.41516,-0.0105 2.37057,1.99113 3.77365,2.59054 1.1817,0.50483 3.77364,0.78809 3.77364,0.78809 v 0.83591 h -15.09457 z"
               style="opacity:1;fill:#ffbf2d;fill-opacity:1;fill-rule:nonzero;stroke:#ffbf2d;stroke-width:0.3856779;stroke-linecap:butt;stroke-linejoin:round;stroke-miterlimit:4;stroke-dasharray:none;stroke-opacity:1" />
            <rect
               style="opacity:1;fill:#ffbf2d;fill-opacity:1;fill-rule:nonzero;stroke:#ffbf2d;stroke-width:0.3856779;stroke-linecap:butt;stroke-linejoin:round;stroke-miterlimit:4;stroke-dasharray:none;stroke-opacity:1"
               id="rect10743"
               width="11.593756"
               height="25.238012"
               x="410.4306"
               y="598.75238"
               rx="2.2232528"
               ry="1.7123834" />
            <circle
               style="opacity:1;fill:#000000;fill-opacity:1;fill-rule:nonzero;stroke:none;stroke-width:0.3856779;stroke-linecap:butt;stroke-linejoin:round;stroke-miterlimit:4;stroke-dasharray:none;stroke-opacity:1"
               id="path10745"
               cx="419.44965"
               cy="609.36414"
               r="1.2458867" />
            <path
               style="fill:#000000;fill-opacity:1;fill-rule:evenodd;stroke:#2d2d2d;stroke-width:0.74045491px;stroke-linecap:butt;stroke-linejoin:miter;stroke-opacity:1"
               d="m 411.65314,603.96684 h 9.14868"
               id="path10747"
               inkscape:connector-curvature="0"
               sodipodi:nodetypes="cc" />
          </g>
        </g>
      </g>
    </g>
  </g>
  <style
     id="style10850"
     type="text/css">
	.st0{opacity:0.15;fill:#292F33;}
	.st1{fill:#FFFFFF;}
</style>
</svg>
