<?xml version="1.0" encoding="UTF-8" standalone="no"?>
<!-- Created with Inkscape (http://www.inkscape.org/) -->

<svg
   xmlns:dc="http://purl.org/dc/elements/1.1/"
   xmlns:cc="http://creativecommons.org/ns#"
   xmlns:rdf="http://www.w3.org/1999/02/22-rdf-syntax-ns#"
   xmlns:svg="http://www.w3.org/2000/svg"
   xmlns="http://www.w3.org/2000/svg"
   xmlns:xlink="http://www.w3.org/1999/xlink"
   xmlns:sodipodi="http://sodipodi.sourceforge.net/DTD/sodipodi-0.dtd"
   xmlns:inkscape="http://www.inkscape.org/namespaces/inkscape"
   width="1920"
   height="1080"
   viewBox="0 0 507.99999 285.75001"
   version="1.1"
   id="svg8"
   inkscape:version="0.92.3 (2405546, 2018-03-11)"
   sodipodi:docname="firstSlide.svg">
  <defs
     id="defs2">
    <inkscape:path-effect
       effect="bspline"
       id="path-effect10907"
       is_visible="true"
       weight="33.333333"
       steps="2"
       helper_size="0"
       apply_no_weight="true"
       apply_with_weight="true"
       only_selected="false" />
    <inkscape:perspective
       sodipodi:type="inkscape:persp3d"
       inkscape:vp_x="0 : 142.875 : 1"
       inkscape:vp_y="0 : 1000 : 0"
       inkscape:vp_z="507.99999 : 142.875 : 1"
       inkscape:persp3d-origin="254 : 95.250003 : 1"
       id="perspective9456" />
    <inkscape:path-effect
       effect="bspline"
       id="path-effect4268"
       is_visible="true"
       weight="33.333333"
       steps="2"
       helper_size="0"
       apply_no_weight="true"
       apply_with_weight="true"
       only_selected="false" />
    <linearGradient
       id="linearGradient4094">
      <stop
         style="stop-color:#232323;stop-opacity:1;"
         offset="0"
         id="stop4096" />
      <stop
         style="stop-color:#4d4d4d;stop-opacity:1;"
         offset="1"
         id="stop4098" />
    </linearGradient>
    <linearGradient
       id="linearGradient4014">
      <stop
         style="stop-color:#a0a0a0;stop-opacity:1;"
         offset="0"
         id="stop4016" />
      <stop
         style="stop-color:#ffffff;stop-opacity:1;"
         offset="1"
         id="stop4018" />
    </linearGradient>
    <linearGradient
       id="linearGradient4678">
      <stop
         style="stop-color:#e5e5e5;stop-opacity:1;"
         offset="0"
         id="stop4680" />
      <stop
         style="stop-color:#d3cdcd;stop-opacity:1;"
         offset="1"
         id="stop4682" />
    </linearGradient>
    <linearGradient
       id="linearGradient4341">
      <stop
         id="stop4343"
         offset="0"
         style="stop-color:#333333;stop-opacity:1;" />
      <stop
         id="stop4345"
         offset="1"
         style="stop-color:#484848;stop-opacity:1;" />
    </linearGradient>
    <linearGradient
       id="linearGradient4696-5">
      <stop
         id="stop4698-6"
         offset="0"
         style="stop-color:#ffb638;stop-opacity:1;" />
      <stop
         id="stop4700-2"
         offset="1"
         style="stop-color:#f0ae26;stop-opacity:1;" />
    </linearGradient>
    <linearGradient
       id="linearGradient4702-3">
      <stop
         id="stop4704-1"
         offset="0"
         style="stop-color:#e34646;stop-opacity:1;" />
      <stop
         id="stop4706-8"
         offset="1"
         style="stop-color:#ffbf2d;stop-opacity:1;" />
    </linearGradient>
    <color-profile
       name="Artifex-PS-CMYK-Profile"
       xlink:href="/usr/share/color/icc/ghostscript/ps_cmyk.icc"
       id="color-profile23" />
    <clipPath
       id="clipPath4501"
       clipPathUnits="userSpaceOnUse">
      <path
         style="clip-rule:evenodd"
         inkscape:connector-curvature="0"
         id="path4499"
         d="M 0,0 H 124.992 V 144 H 0 Z" />
    </clipPath>
    <clipPath
       id="clipPath4525"
       clipPathUnits="userSpaceOnUse">
      <path
         inkscape:connector-curvature="0"
         id="path4523"
         d="M 0,0 H 100 V 125 H 0 Z" />
    </clipPath>
    <clipPath
       id="clipPath4545"
       clipPathUnits="userSpaceOnUse">
      <path
         inkscape:connector-curvature="0"
         id="path4543"
         d="M 0,0 H 100 V 125 H 0 Z" />
    </clipPath>
    <clipPath
       id="clipPath4561"
       clipPathUnits="userSpaceOnUse">
      <path
         inkscape:connector-curvature="0"
         id="path4559"
         d="M 0,0 H 100 V 125 H 0 Z" />
    </clipPath>
    <clipPath
       id="clipPath4577"
       clipPathUnits="userSpaceOnUse">
      <path
         inkscape:connector-curvature="0"
         id="path4575"
         d="M 0,0 H 100 V 125 H 0 Z" />
    </clipPath>
    <clipPath
       id="clipPath4593"
       clipPathUnits="userSpaceOnUse">
      <path
         inkscape:connector-curvature="0"
         id="path4591"
         d="M 0,0 H 100 V 125 H 0 Z" />
    </clipPath>
    <clipPath
       id="clipPath4609"
       clipPathUnits="userSpaceOnUse">
      <path
         inkscape:connector-curvature="0"
         id="path4607"
         d="M 0,0 H 100 V 125 H 0 Z" />
    </clipPath>
    <clipPath
       id="clipPath4625"
       clipPathUnits="userSpaceOnUse">
      <path
         inkscape:connector-curvature="0"
         id="path4623"
         d="M 0,0 H 100 V 125 H 0 Z" />
    </clipPath>
    <clipPath
       id="clipPath4641"
       clipPathUnits="userSpaceOnUse">
      <path
         inkscape:connector-curvature="0"
         id="path4639"
         d="M 0,0 H 100 V 125 H 0 Z" />
    </clipPath>
    <clipPath
       id="clipPath4657"
       clipPathUnits="userSpaceOnUse">
      <path
         inkscape:connector-curvature="0"
         id="path4655"
         d="M 0,0 H 100 V 125 H 0 Z" />
    </clipPath>
    <clipPath
       id="clipPath4673"
       clipPathUnits="userSpaceOnUse">
      <path
         inkscape:connector-curvature="0"
         id="path4671"
         d="M 0,0 H 100 V 125 H 0 Z" />
    </clipPath>
    <style
       id="style3894"
       type="text/css"><![CDATA[
    line, polyline, path, rect, circle {
      fill: none;
      stroke: #000000;
      stroke-linecap: round;
      stroke-linejoin: round;
      stroke-miterlimit: 10.00;
    }
  ]]></style>
    <clipPath
       id="cpNzMuMDYyM3w1NDYuMzIzfDM5My4wNzJ8MzEuMDU2Nw==">
      <rect
         id="rect3902"
         height="362.02"
         width="473.26"
         y="31.06"
         x="73.06" />
    </clipPath>
    <clipPath
       id="cpMHw3MDguNjYxfDUwMy40MjV8MA==">
      <rect
         id="rect3995"
         height="503.43"
         width="708.66"
         y="0.00"
         x="0.00" />
    </clipPath>
    <marker
       inkscape:stockid="Arrow2Send"
       orient="auto"
       refY="0"
       refX="0"
       id="Arrow2Send-3-3"
       style="overflow:visible"
       inkscape:isstock="true">
      <path
         inkscape:connector-curvature="0"
         id="path6389-4-7"
         style="fill:#ffbf2d;fill-opacity:1;fill-rule:evenodd;stroke:#ffbf2d;stroke-width:0.625;stroke-linejoin:round;stroke-opacity:1"
         d="M 8.7185878,4.0337352 -2.2072895,0.01601326 8.7185884,-4.0017078 c -1.7454984,2.3720609 -1.7354408,5.6174519 -6e-7,8.035443 z"
         transform="matrix(-0.3,0,0,-0.3,0.69,0)" />
    </marker>
    <marker
       inkscape:stockid="Arrow2Send"
       orient="auto"
       refY="0"
       refX="0"
       id="Arrow2Send-3-3-6"
       style="overflow:visible"
       inkscape:isstock="true">
      <path
         inkscape:connector-curvature="0"
         id="path6389-4-7-3"
         style="fill:#ffbf2d;fill-opacity:1;fill-rule:evenodd;stroke:#ffbf2d;stroke-width:0.625;stroke-linejoin:round;stroke-opacity:1"
         d="M 8.7185878,4.0337352 -2.2072895,0.01601326 8.7185884,-4.0017078 c -1.7454984,2.3720609 -1.7354408,5.6174519 -6e-7,8.035443 z"
         transform="matrix(-0.3,0,0,-0.3,0.69,0)" />
    </marker>
    <inkscape:path-effect
       effect="bspline"
       id="path-effect10907-2"
       is_visible="true"
       weight="33.333333"
       steps="2"
       helper_size="0"
       apply_no_weight="true"
       apply_with_weight="true"
       only_selected="false" />
    <inkscape:path-effect
       effect="bspline"
       id="path-effect10907-7"
       is_visible="true"
       weight="33.333333"
       steps="2"
       helper_size="0"
       apply_no_weight="true"
       apply_with_weight="true"
       only_selected="false" />
    <inkscape:path-effect
       effect="bspline"
       id="path-effect10907-1"
       is_visible="true"
       weight="33.333333"
       steps="2"
       helper_size="0"
       apply_no_weight="true"
       apply_with_weight="true"
       only_selected="false" />
    <clipPath
       id="clipPath8">
      <path
         inkscape:connector-curvature="0"
         id="path10"
         d="M 76,2 V 48 H 54 V 71 H 35.580737 c -0.07818,0.665694 -0.141485,1.332869 -0.205737,2 -1.151162,12.530963 1.036422,24.087546 6.0625,33.96875 L 43.125,110 c 1.011403,1.81678 2.191241,3.52297 3.4375,5.1875 1.244725,1.66248 1.685716,2.58262 2.46875,3.6875 C 62.319911,133.81083 82.129473,141 105,141 155.64836,141 198.63299,118.56201 217.65625,68.15625 231.15302,69.54122 244.09968,66.080358 250,54.5625 240.60137,49.138835 228.52163,50.877226 221.5625,54.375 L 240,2 168,48 H 145 V 2 Z" />
    </clipPath>
    <clipPath
       id="clipPath24989">
      <path
         inkscape:connector-curvature="0"
         id="path24987"
         d="M 76,2 V 48 H 54 V 71 H 35.580737 c -0.07818,0.665694 -0.141485,1.332869 -0.205737,2 -1.151162,12.530963 1.036422,24.087546 6.0625,33.96875 L 43.125,110 c 1.011403,1.81678 2.191241,3.52297 3.4375,5.1875 1.244725,1.66248 1.685716,2.58262 2.46875,3.6875 C 62.319911,133.81083 82.129473,141 105,141 155.64836,141 198.63299,118.56201 217.65625,68.15625 231.15302,69.54122 244.09968,66.080358 250,54.5625 240.60137,49.138835 228.52163,50.877226 221.5625,54.375 L 240,2 168,48 H 145 V 2 Z" />
    </clipPath>
    <clipPath
       id="clipPath24993">
      <path
         inkscape:connector-curvature="0"
         id="path24991"
         d="M 76,2 V 48 H 54 V 71 H 35.580737 c -0.07818,0.665694 -0.141485,1.332869 -0.205737,2 -1.151162,12.530963 1.036422,24.087546 6.0625,33.96875 L 43.125,110 c 1.011403,1.81678 2.191241,3.52297 3.4375,5.1875 1.244725,1.66248 1.685716,2.58262 2.46875,3.6875 C 62.319911,133.81083 82.129473,141 105,141 155.64836,141 198.63299,118.56201 217.65625,68.15625 231.15302,69.54122 244.09968,66.080358 250,54.5625 240.60137,49.138835 228.52163,50.877226 221.5625,54.375 L 240,2 168,48 H 145 V 2 Z" />
    </clipPath>
    <clipPath
       id="clipPath24997">
      <path
         inkscape:connector-curvature="0"
         id="path24995"
         d="M 76,2 V 48 H 54 V 71 H 35.580737 c -0.07818,0.665694 -0.141485,1.332869 -0.205737,2 -1.151162,12.530963 1.036422,24.087546 6.0625,33.96875 L 43.125,110 c 1.011403,1.81678 2.191241,3.52297 3.4375,5.1875 1.244725,1.66248 1.685716,2.58262 2.46875,3.6875 C 62.319911,133.81083 82.129473,141 105,141 155.64836,141 198.63299,118.56201 217.65625,68.15625 231.15302,69.54122 244.09968,66.080358 250,54.5625 240.60137,49.138835 228.52163,50.877226 221.5625,54.375 L 240,2 168,48 H 145 V 2 Z" />
    </clipPath>
    <clipPath
       id="clipPath25001">
      <path
         inkscape:connector-curvature="0"
         id="path24999"
         d="M 76,2 V 48 H 54 V 71 H 35.580737 c -0.07818,0.665694 -0.141485,1.332869 -0.205737,2 -1.151162,12.530963 1.036422,24.087546 6.0625,33.96875 L 43.125,110 c 1.011403,1.81678 2.191241,3.52297 3.4375,5.1875 1.244725,1.66248 1.685716,2.58262 2.46875,3.6875 C 62.319911,133.81083 82.129473,141 105,141 155.64836,141 198.63299,118.56201 217.65625,68.15625 231.15302,69.54122 244.09968,66.080358 250,54.5625 240.60137,49.138835 228.52163,50.877226 221.5625,54.375 L 240,2 168,48 H 145 V 2 Z" />
    </clipPath>
    <filter
       inkscape:label="Torn Edges"
       inkscape:menu="Distort"
       inkscape:menu-tooltip="Displace the outside of shapes and pictures without altering their content"
       height="1.4"
       y="-0.2"
       width="1.4"
       x="-0.2"
       style="color-interpolation-filters:sRGB;"
       id="filter33308">
      <feTurbulence
         baseFrequency="0.05"
         numOctaves="5"
         type="fractalNoise"
         result="result91"
         id="feTurbulence33302" />
      <feDisplacementMap
         scale="25"
         result="result5"
         xChannelSelector="R"
         in="SourceGraphic"
         in2="result91"
         id="feDisplacementMap33304" />
      <feComposite
         in="SourceGraphic"
         operator="atop"
         in2="result5"
         id="feComposite33306" />
    </filter>
    <linearGradient
       id="linearGradient4702-3-6">
      <stop
         style="stop-color:#ff0000;stop-opacity:0.58431375;"
         offset="0"
         id="stop4704-1-2" />
      <stop
         style="stop-color:#ffcc00;stop-opacity:1;"
         offset="1"
         id="stop4706-8-9" />
    </linearGradient>
    <linearGradient
       inkscape:collect="always"
       xlink:href="#linearGradient4702-3-6"
       id="linearGradient3227"
       gradientUnits="userSpaceOnUse"
       gradientTransform="matrix(0.23495877,0,0,0.23495877,554.34477,146.43138)"
       x1="142.96875"
       y1="63.65625"
       x2="176.60477"
       y2="70.667412" />
    <linearGradient
       inkscape:collect="always"
       xlink:href="#linearGradient4702-3-6"
       id="linearGradient3230"
       gradientUnits="userSpaceOnUse"
       gradientTransform="matrix(0.23495877,0,0,0.23495877,554.33717,-53.838835)"
       x1="113.5146"
       y1="1004.8033"
       x2="78.000107"
       y2="922.07178" />
    <linearGradient
       inkscape:collect="always"
       xlink:href="#linearGradient4696-5"
       id="linearGradient3232"
       gradientUnits="userSpaceOnUse"
       gradientTransform="matrix(-0.1315688,0,0,0.1315688,591.41133,44.770915)"
       x1="108.08774"
       y1="1025.709"
       x2="80.655251"
       y2="1043.709" />
    <linearGradient
       inkscape:collect="always"
       xlink:href="#linearGradient4702-3-6"
       id="linearGradient3234"
       gradientUnits="userSpaceOnUse"
       gradientTransform="matrix(-0.23495877,0,0,0.23495877,602.06341,146.43131)"
       x1="142.96875"
       y1="63.65625"
       x2="177.04297"
       y2="69.791016" />
  </defs>
  <sodipodi:namedview
     id="base"
     pagecolor="#ffffff"
     bordercolor="#f70bff"
     borderopacity="1"
     inkscape:pageopacity="0.0"
     inkscape:pageshadow="2"
     inkscape:zoom="0.25"
     inkscape:cx="1190"
     inkscape:cy="553.50685"
     inkscape:document-units="px"
     inkscape:current-layer="layer1"
     showgrid="false"
     units="px"
     borderlayer="true"
     inkscape:showpageshadow="false"
     inkscape:pagecheckerboard="true"
     inkscape:window-width="1257"
     inkscape:window-height="614"
     inkscape:window-x="47"
     inkscape:window-y="27"
     inkscape:window-maximized="1"
     showguides="false"
     inkscape:lockguides="false" />
  <metadata
     id="metadata5">
    <rdf:RDF>
      <cc:Work
         rdf:about="">
        <dc:format>image/svg+xml</dc:format>
        <dc:type
           rdf:resource="http://purl.org/dc/dcmitype/StillImage" />
        <dc:title />
        <cc:license
           rdf:resource="http://creativecommons.org/licenses/by-sa/4.0/" />
      </cc:Work>
      <cc:License
         rdf:about="http://creativecommons.org/licenses/by-sa/4.0/">
        <cc:permits
           rdf:resource="http://creativecommons.org/ns#Reproduction" />
        <cc:permits
           rdf:resource="http://creativecommons.org/ns#Distribution" />
        <cc:requires
           rdf:resource="http://creativecommons.org/ns#Notice" />
        <cc:requires
           rdf:resource="http://creativecommons.org/ns#Attribution" />
        <cc:permits
           rdf:resource="http://creativecommons.org/ns#DerivativeWorks" />
        <cc:requires
           rdf:resource="http://creativecommons.org/ns#ShareAlike" />
      </cc:License>
    </rdf:RDF>
  </metadata>
  <g
     inkscape:label="Layer 1"
     inkscape:groupmode="layer"
     id="layer1"
     transform="translate(0,-11.249975)">
    <rect
       style="color:#000000;clip-rule:nonzero;display:inline;overflow:visible;visibility:visible;opacity:1;isolation:auto;mix-blend-mode:normal;color-interpolation:sRGB;color-interpolation-filters:linearRGB;solid-color:#000000;solid-opacity:1;vector-effect:none;fill:#232323;fill-opacity:1;fill-rule:nonzero;stroke:none;stroke-width:0.3055087;stroke-linecap:round;stroke-linejoin:round;stroke-miterlimit:4;stroke-dasharray:none;stroke-dashoffset:0;stroke-opacity:1;color-rendering:auto;image-rendering:auto;shape-rendering:auto;text-rendering:auto;enable-background:accumulate"
       id="rect2926"
       width="512.95203"
       height="292.72192"
       x="-2.0354033"
       y="8.4516382" />
    <text
       xml:space="preserve"
       style="font-style:normal;font-variant:normal;font-weight:normal;font-stretch:normal;font-size:7.76111126px;line-height:1.25;font-family:'League Gothic';-inkscape-font-specification:'League Gothic';letter-spacing:0px;word-spacing:0px;fill:#000000;fill-opacity:1;stroke:none;stroke-width:0.26458335"
       x="142.99869"
       y="229.88542"
       id="text977"><tspan
         sodipodi:role="line"
         id="tspan975"
         x="142.99869"
         y="229.88542"
         style="font-size:42.33333206px;fill:#ffffff;stroke-width:0.26458335">Installing GNU Guix</tspan></text>
    <g
       id="g1133"
       transform="matrix(3.2220374,0,0,3.2220374,-1659.0042,-442.8338)">
      <rect
         style="fill:#232323;fill-opacity:1;stroke:none;stroke-width:0.26458335;stroke-linecap:round;stroke-linejoin:round;stroke-miterlimit:10"
         id="rect3204"
         width="97.895836"
         height="34.395832"
         x="544.7771"
         y="152.80206" />
      <path
         id="path3207"
         d="m 597.4891,157.59188 c -0.42374,0.77444 -0.85393,1.40491 -1.29227,1.90169 -0.42374,0.48221 -0.89101,0.86789 -1.40241,1.16012 -0.4968,0.27763 -1.06047,0.47786 -1.68877,0.59473 -0.61368,0.10229 -1.31833,0.15423 -2.12197,0.1542 -0.59281,0 -1.12557,-0.0304 -1.59331,-0.0881 -0.002,0 -0.005,0 -0.007,0 -0.0593,-0.004 -0.18178,-0.0241 -0.30839,-0.044 -0.13335,-0.0209 -0.26966,-0.041 -0.4846,-0.0808 -3.9399,-0.72898 -5.24657,2.00618 -5.52888,2.76077 -0.0442,0.11811 -0.0661,0.1909 -0.0661,0.1909 l -4.78728,13.3486 -2.93698,4.9929 h 5.86662 c 2.40948,-5.3648 4.72596,-16.56636 7.20296,-17.55582 0.53688,0.0751 1.20237,0.11012 2.00449,0.11012 1.05204,0 1.99398,-0.12613 2.82685,-0.38915 0.83285,-0.26303 1.582,-0.67096 2.25413,-1.22621 0.67214,-0.56984 1.2803,-1.29665 1.82094,-2.17337 0.55523,-0.87667 1.08182,-1.92987 1.57862,-3.15725 l -1.33631,-0.49929 z"
         style="font-style:normal;font-weight:bold;font-size:144px;line-height:125%;font-family:Sans;-inkscape-font-specification:'Sans Bold';letter-spacing:0px;word-spacing:0px;fill:#ffbf2d;fill-opacity:1;stroke:none;stroke-width:0.26458335;stroke-linecap:round;stroke-linejoin:round;stroke-miterlimit:10"
         inkscape:connector-curvature="0" />
      <path
         inkscape:connector-curvature="0"
         id="path3209"
         d="m 597.48895,157.59244 c -0.42374,0.77443 -0.8539,1.40403 -1.29225,1.90081 -0.42373,0.48221 -0.89118,0.86808 -1.40258,1.16031 -0.12304,0.0687 -0.24987,0.13192 -0.38108,0.19111 -10e-4,0 -0.002,0.003 -0.003,0.003 -0.16515,0.11615 -0.37756,0.21585 -0.66546,0.28437 -3.3205,0.7906 -5.58219,3.74976 -5.79463,4.03601 0.0963,-0.0792 0.19328,-0.14385 0.29007,-0.19338 0.0146,-0.008 0.0287,-0.0148 0.0432,-0.0217 0.002,0 0.004,-0.003 0.007,-0.003 0.0169,-0.008 0.0343,-0.0148 0.0512,-0.0217 0.53688,0.0751 1.20223,0.11033 2.00435,0.11033 1.05204,0 1.99392,-0.12716 2.82678,-0.39016 0.83286,-0.26302 1.58133,-0.6699 2.25347,-1.22515 0.67214,-0.56983 1.28057,-1.29712 1.82121,-2.17382 0.55523,-0.87669 1.0821,-1.93042 1.5789,-3.15783 l -1.33661,-0.49823 z"
         style="font-style:normal;font-weight:bold;font-size:144px;line-height:125%;font-family:Sans;-inkscape-font-specification:'Sans Bold';letter-spacing:0px;word-spacing:0px;fill:url(#linearGradient3227);fill-opacity:1;stroke:none;stroke-width:0.26458335;stroke-linecap:round;stroke-linejoin:round;stroke-miterlimit:10" />
      <path
         id="path3211"
         d="m 558.91911,157.59188 c 0.42374,0.77444 0.85392,1.40491 1.29227,1.90169 0.42374,0.48221 0.89101,0.86789 1.40241,1.16012 0.4968,0.27763 1.06047,0.47786 1.68877,0.59473 0.61369,0.10232 1.31833,0.15423 2.12197,0.1542 0.59281,0 1.12557,-0.0304 1.59331,-0.0881 0.002,0 0.005,0 0.007,0 0.0593,-0.004 0.18178,-0.0241 0.30838,-0.044 0.13336,-0.0209 0.26967,-0.041 0.48461,-0.0808 3.93989,-0.72898 5.24657,2.00618 5.52887,2.76077 0.0442,0.11811 0.0661,0.1909 0.0661,0.1909 l 4.78729,13.3486 2.93698,4.9929 h -5.86662 c -2.40948,-5.3648 -4.72596,-16.56636 -7.20296,-17.55582 -0.53688,0.0751 -1.20237,0.11012 -2.00449,0.11012 -1.05204,0 -1.99399,-0.12613 -2.82685,-0.38915 -0.83286,-0.26303 -1.582,-0.67096 -2.25414,-1.22621 -0.67212,-0.56984 -1.28029,-1.29665 -1.82092,-2.17337 -0.55524,-0.87667 -1.08183,-1.92987 -1.57864,-3.15725 l 1.33633,-0.49929 z"
         style="font-style:normal;font-weight:bold;font-size:144px;line-height:125%;font-family:Sans;-inkscape-font-specification:'Sans Bold';letter-spacing:0px;word-spacing:0px;fill:#ffbf2d;fill-opacity:1;stroke:none;stroke-width:0.26458335;stroke-linecap:round;stroke-linejoin:round;stroke-miterlimit:10"
         inkscape:connector-curvature="0" />
      <path
         inkscape:connector-curvature="0"
         style="font-style:normal;font-weight:bold;font-size:144px;line-height:125%;font-family:Sans;-inkscape-font-specification:'Sans Bold';letter-spacing:0px;word-spacing:0px;fill:url(#linearGradient3230);fill-opacity:1;stroke:none;stroke-width:0.26458335;stroke-linecap:round;stroke-linejoin:round;stroke-miterlimit:10"
         d="m 558.91887,157.59169 c 0.42374,0.77444 0.85393,1.40492 1.29227,1.9017 0.42374,0.4822 0.89101,0.86788 1.40241,1.16012 0.4968,0.27762 1.06047,0.47783 1.68877,0.59473 0.61369,0.10231 1.31833,0.15422 2.12197,0.15417 0.59281,0 1.12557,-0.0303 1.59331,-0.0881 0.002,0 0.005,0 0.007,0 0.0593,-0.004 0.18178,-0.0243 0.30839,-0.044 0.13335,-0.0209 0.26966,-0.041 0.4846,-0.0808 3.9399,-0.72898 5.24657,2.00615 5.52888,2.76077 0.0442,0.11811 0.0661,0.19089 0.0661,0.19089 l 4.78728,13.3486 2.46707,4.9929 h -5.39675 c -2.40948,-5.36482 -4.72596,-16.56635 -7.20296,-17.55584 -0.53688,0.0751 -1.20237,0.11012 -2.00449,0.11012 -1.05204,0 -1.99399,-0.12613 -2.82685,-0.38913 -0.83286,-0.26302 -1.582,-0.67095 -2.25414,-1.22621 -0.67212,-0.56983 -1.28029,-1.29667 -1.82092,-2.17336 -0.55524,-0.87667 -1.08183,-1.92987 -1.57864,-3.15725 l 1.33633,-0.4993 z"
         id="path3213"
         sodipodi:nodetypes="ccccccccsscccccccccccc" />
      <path
         sodipodi:nodetypes="ccc"
         d="m 578.19918,177.48786 -2.92546,4.99499 h 5.8637"
         style="font-style:normal;font-weight:bold;font-size:144px;line-height:125%;font-family:Sans;-inkscape-font-specification:'Sans Bold';letter-spacing:0px;word-spacing:0px;fill:url(#linearGradient3232);fill-opacity:1;stroke:none;stroke-width:0.26458335;stroke-linecap:round;stroke-linejoin:round;stroke-miterlimit:10"
         id="path3215"
         inkscape:connector-curvature="0" />
      <path
         inkscape:connector-curvature="0"
         id="path3217"
         d="m 558.9195,157.59244 -1.33661,0.49823 c 0.15525,0.38357 0.31333,0.75055 0.47436,1.10001 0.0322,0.0699 0.0643,0.13851 0.0967,0.20703 1.3e-4,2.4e-4 -1.2e-4,0 0,0 0.0323,0.0682 0.0653,0.13563 0.0978,0.20246 0.0109,0.0222 0.0221,0.0439 0.033,0.066 0.0545,0.11113 0.10863,0.22143 0.16381,0.32875 2.5e-4,0 7.9e-4,0 10e-4,0 0.0329,0.064 0.0659,0.12737 0.099,0.18997 0.13354,0.25252 0.26892,0.49416 0.4061,0.72461 0.0342,0.0575 0.0679,0.11332 0.10237,0.16949 0.0134,0.0217 0.0264,0.0433 0.0398,0.0649 0.0213,0.0343 0.0434,0.0685 0.0648,0.10237 0.0338,0.0548 0.0669,0.10906 0.10124,0.16267 0.0547,0.0854 0.11121,0.16896 0.16722,0.2514 0.0141,0.0209 0.0279,0.0419 0.0421,0.0626 0.0355,0.0515 0.0709,0.10208 0.10693,0.15243 0.0718,0.10015 0.14456,0.19807 0.21841,0.29348 0.0369,0.0477 0.074,0.0945 0.11148,0.14105 0.0749,0.093 0.15057,0.18364 0.22751,0.27188 0.0583,0.0669 0.11795,0.13266 0.17745,0.1968 0.0188,0.0204 0.038,0.0403 0.0569,0.0603 0.0792,0.0836 0.15883,0.1647 0.24003,0.24344 0.0405,0.0393 0.0807,0.078 0.12171,0.11602 0.0412,0.0383 0.0823,0.0756 0.124,0.11264 0.0415,0.0368 0.0831,0.0724 0.12513,0.10805 0.12602,0.10411 0.25528,0.20312 0.38676,0.29689 0.35062,0.25006 0.72078,0.46355 1.11138,0.64045 0.0488,0.0222 0.0973,0.0439 0.14674,0.0648 0.0992,0.0421 0.19962,0.0819 0.30145,0.11946 0.0507,0.0188 0.10103,0.0359 0.15243,0.0535 0.0514,0.0175 0.10379,0.0347 0.15584,0.0512 0.0521,0.0164 0.10408,0.0324 0.15698,0.0478 0.10582,0.0307 0.21384,0.06 0.32306,0.0864 0.0546,0.0132 0.10948,0.0254 0.16495,0.0376 0.0555,0.0122 0.1109,0.0241 0.16722,0.0353 0.0567,0.0114 0.11308,0.0217 0.17063,0.0319 0.11435,0.0204 0.23031,0.0385 0.34808,0.0546 0.17667,0.0241 0.3571,0.0442 0.54147,0.0591 0.12292,0.01 0.2479,0.018 0.37425,0.0238 0.12635,0.006 0.25471,0.01 0.38449,0.0114 0.0649,0 0.12991,0 0.19566,0 0.10026,0 0.19861,-3e-5 0.29462,0 0.19203,-0.003 0.37538,-0.007 0.55057,-0.0138 0.0872,-0.003 0.17286,-0.007 0.25595,-0.0114 0.0834,-0.004 0.16526,-0.01 0.24457,-0.0159 0.23793,-0.0172 0.4573,-0.0389 0.65864,-0.0671 0.0169,0.007 0.0343,0.0138 0.0512,0.0217 0.002,0 0.005,0.003 0.007,0.003 0.0146,0.007 0.0287,0.014 0.0432,0.0217 0.0968,0.0496 0.19368,0.11414 0.29007,0.19338 -0.21199,-0.28567 -2.47375,-3.24532 -5.79463,-4.03598 -0.2879,-0.0685 -0.50032,-0.16825 -0.66546,-0.2844 -0.001,0 -0.002,-0.003 -0.003,-0.003 -0.13091,-0.059 -0.25831,-0.12253 -0.38108,-0.19111 -2.5e-4,-1e-4 -7.9e-4,1.4e-4 -10e-4,0 -0.0317,-0.018 -0.0631,-0.0369 -0.0944,-0.0557 -2.5e-4,-1.3e-4 -7.9e-4,1.1e-4 -10e-4,0 -0.0316,-0.019 -0.062,-0.0383 -0.0933,-0.058 -0.0628,-0.0396 -0.12514,-0.0803 -0.18656,-0.12284 -0.0306,-0.0212 -0.0608,-0.0429 -0.091,-0.0649 -0.0609,-0.0442 -0.12021,-0.0893 -0.17973,-0.1365 -0.0296,-0.0236 -0.0584,-0.0464 -0.0876,-0.0705 -0.0294,-0.0243 -0.0585,-0.0488 -0.0876,-0.0739 -0.0289,-0.0249 -0.0568,-0.0506 -0.0853,-0.0762 -0.14264,-0.12819 -0.28108,-0.26487 -0.4152,-0.4118 -0.0268,-0.0294 -0.0543,-0.0597 -0.0808,-0.0898 -0.0975,-0.11046 -0.19453,-0.2277 -0.29121,-0.3515 -0.012,-0.0153 -0.0233,-0.031 -0.0353,-0.0466 -0.0272,-0.0353 -0.0548,-0.0706 -0.0819,-0.10692 -0.13544,-0.18169 -0.26982,-0.37711 -0.40382,-0.58584 -0.0536,-0.0835 -0.10701,-0.1692 -0.1604,-0.25709 -0.0267,-0.0439 -0.053,-0.088 -0.0796,-0.13309 -0.0797,-0.13472 -0.15968,-0.27503 -0.23888,-0.41976 z"
         style="font-style:normal;font-weight:bold;font-size:144px;line-height:125%;font-family:Sans;-inkscape-font-specification:'Sans Bold';letter-spacing:0px;word-spacing:0px;fill:url(#linearGradient3234);fill-opacity:1;stroke:none;stroke-width:0.26458335;stroke-linecap:round;stroke-linejoin:round;stroke-miterlimit:10" />
      <path
         inkscape:connector-curvature="0"
         id="path3219"
         style="font-style:normal;font-weight:bold;font-size:144px;line-height:125%;font-family:Sans;-inkscape-font-specification:'Sans Bold';letter-spacing:0px;word-spacing:0px;fill:#ffffff;fill-opacity:1;stroke:none;stroke-width:0.26458335;stroke-linecap:round;stroke-linejoin:round;stroke-miterlimit:10"
         d="m 601.17526,181.275 c -0.82978,0.40336 -1.69124,0.70588 -2.58438,0.90757 -0.89316,0.20167 -1.81511,0.3025 -2.76588,0.3025 -2.14933,0 -3.85207,-0.59928 -5.10824,-1.79782 -1.25617,-1.2043 -1.88426,-2.83501 -1.88426,-4.89214 0,-2.08018 0.63961,-3.71666 1.91884,-4.90945 1.27921,-1.1928 3.03094,-1.78917 5.25517,-1.78919 0.85857,2e-5 1.67969,0.0807 2.46337,0.24201 0.78942,0.16137 1.53275,0.4005 2.22999,0.71742 v 2.67078 c -0.72029,-0.4091 -1.43769,-0.71451 -2.1522,-0.91617 -0.70877,-0.20167 -1.42041,-0.30253 -2.13492,-0.30253 -1.32532,0 -2.34813,0.37166 -3.0684,1.11501 -0.71453,0.73758 -1.07179,1.79493 -1.07178,3.17212 -10e-6,1.36564 0.34573,2.42014 1.0372,3.16346 0.69147,0.74335 1.67393,1.11501 2.9474,1.11501 0.34573,0 0.66553,-0.0201 0.95942,-0.0605 0.29962,-0.0461 0.56757,-0.11523 0.80383,-0.20743 v -2.50659 h -2.0312 v -2.22999 h 5.18603 v 6.20594" />
      <path
         inkscape:connector-curvature="0"
         id="path3221"
         style="font-style:normal;font-weight:bold;font-size:144px;line-height:125%;font-family:Sans;-inkscape-font-specification:'Sans Bold';letter-spacing:0px;word-spacing:0px;fill:#ffffff;fill-opacity:1;stroke:none;stroke-width:0.26458335;stroke-linecap:round;stroke-linejoin:round;stroke-miterlimit:10"
         d="m 602.62543,178.46589 v -5.91206 h 3.11161 v 0.96806 c 0,0.52437 -0.003,1.18417 -0.009,1.97932 -0.006,0.78946 -0.009,1.3167 -0.009,1.58176 0,0.7779 0.0202,1.33971 0.0605,1.68545 0.0403,0.33998 0.10948,0.58774 0.20745,0.74332 0.12676,0.20169 0.29098,0.35726 0.49267,0.46675 0.20743,0.10951 0.44369,0.16422 0.70876,0.16422 0.64536,0 1.15244,-0.24775 1.52123,-0.74332 0.36878,-0.49553 0.55317,-1.18414 0.55318,-2.06576 v -4.7798 h 3.09433 v 9.6806 h -3.09433 v -1.40023 c -0.46675,0.5647 -0.9623,0.98245 -1.48666,1.25328 -0.51861,0.26506 -1.09196,0.39759 -1.72004,0.39759 -1.11788,0 -1.97069,-0.34285 -2.55844,-1.02854 -0.58199,-0.68572 -0.87298,-1.68259 -0.87298,-2.99064" />
      <path
         inkscape:connector-curvature="0"
         id="path3223"
         style="font-style:normal;font-weight:bold;font-size:144px;line-height:125%;font-family:Sans;-inkscape-font-specification:'Sans Bold';letter-spacing:0px;word-spacing:0px;fill:#ffffff;fill-opacity:1;stroke:none;stroke-width:0.26458335;stroke-linecap:round;stroke-linejoin:round;stroke-miterlimit:10"
         d="m 614.11921,172.55383 h 3.09433 v 9.6806 h -3.09433 v -9.6806 m 0,-3.76851 h 3.09433 v 2.52386 h -3.09433 v -2.52386" />
      <path
         inkscape:connector-curvature="0"
         id="path3225"
         style="font-style:normal;font-weight:bold;font-size:144px;line-height:125%;font-family:Sans;-inkscape-font-specification:'Sans Bold';letter-spacing:0px;word-spacing:0px;fill:#ffffff;fill-opacity:1;stroke:none;stroke-width:0.26458335;stroke-linecap:round;stroke-linejoin:round;stroke-miterlimit:10"
         d="m 622.65023,177.28175 -3.49193,-4.72792 h 3.27584 l 1.97934,2.86959 2.00526,-2.86959 h 3.27584 l -3.49192,4.71064 3.66479,4.96996 h -3.27584 l -2.17813,-3.05977 -2.15221,3.05977 h -3.27584 l 3.6648,-4.95268" />
    </g>
  </g>
  <style
     id="style10850"
     type="text/css">
	.st0{opacity:0.15;fill:#292F33;}
	.st1{fill:#FFFFFF;}
</style>
</svg>
